Results for array-compat.test.sh

casebashmkshoshosh_ALTdescription
0pass pass FAIL FAIL Assignment Causes Array Decay
detailsdetails
1pass pass FAIL FAIL User arrays decay
detailsdetails
2pass pass FAIL FAIL $a gives first element of array
detailsdetails
3pass pass FAIL FAIL Assign to array index without initialization
detailsdetails
4pass pass FAIL FAIL a[40] grows array
detailsdetails
5pass pass FAIL FAIL array decays to string when comparing with [[ a = b ]]
detailsdetails
6pass pass FAIL FAIL Increment array variables
detailsdetails

14 passed, 0 ok, 0 known unimplemented, 0 known bugs, 7 failed, 0 skipped

Details on runs that didn't PASS

osh0 Assignment Causes Array Decay

[osh stdout] Expected "['[x y z]']\n", got "['[x', 'y', 'z]']\n"

stdout:
['[x', 'y', 'z]']
stderr:
osh_ALT0 Assignment Causes Array Decay

[osh_ALT stdout] Expected "['[x y z]']\n", got "['[x', 'y', 'z]']\n"

stdout:
['[x', 'y', 'z]']
stderr:
osh1 User arrays decay

[osh stdout] Expected "['x', 'y', 'z', 'x y z', 'x', 'YYY', 'z']\n", got "['x', 'y', 'z', 'x', 'y', 'z', 'x', 'y', 'z']\n"

stdout:
['x', 'y', 'z', 'x', 'y', 'z', 'x', 'y', 'z']
stderr:
Unexpected error in execvpe('c[1]=YYY', ['c[1]=YYY'], ...): [Errno 2] No such file or directory
osh_ALT1 User arrays decay

[osh_ALT stdout] Expected "['x', 'y', 'z', 'x y z', 'x', 'YYY', 'z']\n", got "['x', 'y', 'z', 'x', 'y', 'z', 'x', 'y', 'z']\n"

stdout:
['x', 'y', 'z', 'x', 'y', 'z', 'x', 'y', 'z']
stderr:
Unexpected error in execvpe('c[1]=YYY', ['c[1]=YYY'], ...): [Errno 2] No such file or directory
osh2 $a gives first element of array

[osh stdout] Expected '1\n', got '1 2 3\n'

stdout:
1 2 3
stderr:
osh_ALT2 $a gives first element of array

[osh_ALT stdout] Expected '1\n', got '1 2 3\n'

stdout:
1 2 3
stderr:
osh3 Assign to array index without initialization

[osh stdout] Expected '5 6 2\n', got ''
[osh status] Expected 0, got 1

stdout:
stderr: 
Unexpected error in execvpe('a[5]=5', ['a[5]=5'], ...): [Errno 2] No such file or directory
Unexpected error in execvpe('a[6]=6', ['a[6]=6'], ...): [Errno 2] No such file or directory
Traceback (most recent call last):
  File "bin/osh", line 509, in <module>
    main(sys.argv)
  File "bin/osh", line 492, in main
    sys.exit(OilMain(argv))
  File "bin/osh", line 475, in OilMain
    status = OshMain(main_argv, login_shell)
  File "bin/osh", line 413, in OshMain
    status = ex.Execute(node)
  File "/home/andy/git/oilshell/oil/bin/../core/cmd_exec.py", line 985, in Execute
    status = self._Execute(node, fork_external=fork_external)
  File "/home/andy/git/oilshell/oil/bin/../core/cmd_exec.py", line 949, in _Execute
    status, check_errexit = self._Dispatch(node, fork_external)
  File "/home/andy/git/oilshell/oil/bin/../core/cmd_exec.py", line 758, in _Dispatch
    status = self._ExecuteList(node.children)
  File "/home/andy/git/oilshell/oil/bin/../core/cmd_exec.py", line 978, in _ExecuteList
    status = self._Execute(child)  # last status wins
  File "/home/andy/git/oilshell/oil/bin/../core/cmd_exec.py", line 949, in _Execute
    status, check_errexit = self._Dispatch(node, fork_external)
  File "/home/andy/git/oilshell/oil/bin/../core/cmd_exec.py", line 624, in _Dispatch
    argv = self.ev.EvalWordSequence(words)
  File "/home/andy/git/oilshell/oil/bin/../core/word_eval.py", line 1106, in EvalWordSequence
    return self._EvalWordSequence(words)
  File "/home/andy/git/oilshell/oil/bin/../core/word_eval.py", line 1086, in _EvalWordSequence
    args = self._EvalWordAndReframe(w)
  File "/home/andy/git/oilshell/oil/bin/../core/word_eval.py", line 1039, in _EvalWordAndReframe
    part_vals = self._EvalParts(word)
  File "/home/andy/git/oilshell/oil/bin/../core/word_eval.py", line 933, in _EvalParts
    for v in self.part_ev._EvalWordPart(p, quoted=quoted):
  File "/home/andy/git/oilshell/oil/bin/../core/word_eval.py", line 892, in _EvalWordPart
    return self._EvalBracedVarSub(part, quoted)
  File "/home/andy/git/oilshell/oil/bin/../core/word_eval.py", line 825, in _EvalBracedVarSub
    val = self._DecayArray(val)
  File "/home/andy/git/oilshell/oil/bin/../core/word_eval.py", line 632, in _DecayArray
    assert val.tag == value_e.StrArray, val
AssertionError: (Str s:0)
osh_ALT3 Assign to array index without initialization

[osh_ALT stdout] Expected '5 6 2\n', got ''
[osh_ALT status] Expected 0, got 1

stdout:
stderr: 
Unexpected error in execvpe('a[5]=5', ['a[5]=5'], ...): [Errno 2] No such file or directory
Unexpected error in execvpe('a[6]=6', ['a[6]=6'], ...): [Errno 2] No such file or directory
Traceback (most recent call last):
  File "/home/andy/git/oilshell/oil/Python-2.7.13/Lib/runpy.py", line 174, in _run_module_as_main
    "__main__", fname, loader, pkg_name)
  File "/home/andy/git/oilshell/oil/Python-2.7.13/Lib/runpy.py", line 72, in _run_code
    exec code in run_globals
  File "/home/andy/git/oilshell/oil/bin/oil.py", line 509, in <module>
    main(sys.argv)
  File "/home/andy/git/oilshell/oil/bin/oil.py", line 492, in main
    sys.exit(OilMain(argv))
  File "/home/andy/git/oilshell/oil/bin/oil.py", line 475, in OilMain
    status = OshMain(main_argv, login_shell)
  File "/home/andy/git/oilshell/oil/bin/oil.py", line 413, in OshMain
    status = ex.Execute(node)
  File "/home/andy/git/oilshell/oil/bin/../core/cmd_exec.py", line 985, in Execute
    status = self._Execute(node, fork_external=fork_external)
  File "/home/andy/git/oilshell/oil/bin/../core/cmd_exec.py", line 949, in _Execute
    status, check_errexit = self._Dispatch(node, fork_external)
  File "/home/andy/git/oilshell/oil/bin/../core/cmd_exec.py", line 758, in _Dispatch
    status = self._ExecuteList(node.children)
  File "/home/andy/git/oilshell/oil/bin/../core/cmd_exec.py", line 978, in _ExecuteList
    status = self._Execute(child)  # last status wins
  File "/home/andy/git/oilshell/oil/bin/../core/cmd_exec.py", line 949, in _Execute
    status, check_errexit = self._Dispatch(node, fork_external)
  File "/home/andy/git/oilshell/oil/bin/../core/cmd_exec.py", line 624, in _Dispatch
    argv = self.ev.EvalWordSequence(words)
  File "/home/andy/git/oilshell/oil/bin/../core/word_eval.py", line 1106, in EvalWordSequence
    return self._EvalWordSequence(words)
  File "/home/andy/git/oilshell/oil/bin/../core/word_eval.py", line 1086, in _EvalWordSequence
    args = self._EvalWordAndReframe(w)
  File "/home/andy/git/oilshell/oil/bin/../core/word_eval.py", line 1039, in _EvalWordAndReframe
    part_vals = self._EvalParts(word)
  File "/home/andy/git/oilshell/oil/bin/../core/word_eval.py", line 933, in _EvalParts
    for v in self.part_ev._EvalWordPart(p, quoted=quoted):
  File "/home/andy/git/oilshell/oil/bin/../core/word_eval.py", line 892, in _EvalWordPart
    return self._EvalBracedVarSub(part, quoted)
  File "/home/andy/git/oilshell/oil/bin/../core/word_eval.py", line 825, in _EvalBracedVarSub
    val = self._DecayArray(val)
  File "/home/andy/git/oilshell/oil/bin/../core/word_eval.py", line 632, in _DecayArray
    assert val.tag == value_e.StrArray, val
AssertionError: (Str s:0)
FATAL: couldn't import from app bundle '_bin/osh' (1)
Stripping the oil.ovm binary may cause this error.
See https://github.com/oilshell/oil/issues/47
osh4 a[40] grows array

[osh stdout] Expected '1 5 3 20 30 5\n', got '1 2 3 3\n'

stdout:
1 2 3 3
stderr:
Unexpected error in execvpe('a[1]=5', ['a[1]=5'], ...): [Errno 2] No such file or directory
Unexpected error in execvpe('a[40]=30', ['a[40]=30'], ...): [Errno 2] No such file or directory
Unexpected error in execvpe('a[10]=20', ['a[10]=20'], ...): [Errno 2] No such file or directory
osh_ALT4 a[40] grows array

[osh_ALT stdout] Expected '1 5 3 20 30 5\n', got '1 2 3 3\n'

stdout:
1 2 3 3
stderr:
Unexpected error in execvpe('a[1]=5', ['a[1]=5'], ...): [Errno 2] No such file or directory
Unexpected error in execvpe('a[40]=30', ['a[40]=30'], ...): [Errno 2] No such file or directory
Unexpected error in execvpe('a[10]=20', ['a[10]=20'], ...): [Errno 2] No such file or directory
osh5 array decays to string when comparing with [[ a = b ]]

[osh stdout] Expected u'2 7\nEQUAL\n', got ''
[osh status] Expected 0, got 1

stdout:
stderr: 
Traceback (most recent call last):
  File "bin/osh", line 509, in <module>
    main(sys.argv)
  File "bin/osh", line 492, in main
    sys.exit(OilMain(argv))
  File "bin/osh", line 475, in OilMain
    status = OshMain(main_argv, login_shell)
  File "bin/osh", line 413, in OshMain
    status = ex.Execute(node)
  File "/home/andy/git/oilshell/oil/bin/../core/cmd_exec.py", line 985, in Execute
    status = self._Execute(node, fork_external=fork_external)
  File "/home/andy/git/oilshell/oil/bin/../core/cmd_exec.py", line 949, in _Execute
    status, check_errexit = self._Dispatch(node, fork_external)
  File "/home/andy/git/oilshell/oil/bin/../core/cmd_exec.py", line 758, in _Dispatch
    status = self._ExecuteList(node.children)
  File "/home/andy/git/oilshell/oil/bin/../core/cmd_exec.py", line 978, in _ExecuteList
    status = self._Execute(child)  # last status wins
  File "/home/andy/git/oilshell/oil/bin/../core/cmd_exec.py", line 949, in _Execute
    status, check_errexit = self._Dispatch(node, fork_external)
  File "/home/andy/git/oilshell/oil/bin/../core/cmd_exec.py", line 624, in _Dispatch
    argv = self.ev.EvalWordSequence(words)
  File "/home/andy/git/oilshell/oil/bin/../core/word_eval.py", line 1106, in EvalWordSequence
    return self._EvalWordSequence(words)
  File "/home/andy/git/oilshell/oil/bin/../core/word_eval.py", line 1086, in _EvalWordSequence
    args = self._EvalWordAndReframe(w)
  File "/home/andy/git/oilshell/oil/bin/../core/word_eval.py", line 1039, in _EvalWordAndReframe
    part_vals = self._EvalParts(word)
  File "/home/andy/git/oilshell/oil/bin/../core/word_eval.py", line 933, in _EvalParts
    for v in self.part_ev._EvalWordPart(p, quoted=quoted):
  File "/home/andy/git/oilshell/oil/bin/../core/word_eval.py", line 892, in _EvalWordPart
    return self._EvalBracedVarSub(part, quoted)
  File "/home/andy/git/oilshell/oil/bin/../core/word_eval.py", line 825, in _EvalBracedVarSub
    val = self._DecayArray(val)
  File "/home/andy/git/oilshell/oil/bin/../core/word_eval.py", line 632, in _DecayArray
    assert val.tag == value_e.StrArray, val
AssertionError: (Str s:2)
osh_ALT5 array decays to string when comparing with [[ a = b ]]

[osh_ALT stdout] Expected u'2 7\nEQUAL\n', got ''
[osh_ALT status] Expected 0, got 1

stdout:
stderr: 
Traceback (most recent call last):
  File "/home/andy/git/oilshell/oil/Python-2.7.13/Lib/runpy.py", line 174, in _run_module_as_main
    "__main__", fname, loader, pkg_name)
  File "/home/andy/git/oilshell/oil/Python-2.7.13/Lib/runpy.py", line 72, in _run_code
    exec code in run_globals
  File "/home/andy/git/oilshell/oil/bin/oil.py", line 509, in <module>
    main(sys.argv)
  File "/home/andy/git/oilshell/oil/bin/oil.py", line 492, in main
    sys.exit(OilMain(argv))
  File "/home/andy/git/oilshell/oil/bin/oil.py", line 475, in OilMain
    status = OshMain(main_argv, login_shell)
  File "/home/andy/git/oilshell/oil/bin/oil.py", line 413, in OshMain
    status = ex.Execute(node)
  File "/home/andy/git/oilshell/oil/bin/../core/cmd_exec.py", line 985, in Execute
    status = self._Execute(node, fork_external=fork_external)
  File "/home/andy/git/oilshell/oil/bin/../core/cmd_exec.py", line 949, in _Execute
    status, check_errexit = self._Dispatch(node, fork_external)
  File "/home/andy/git/oilshell/oil/bin/../core/cmd_exec.py", line 758, in _Dispatch
    status = self._ExecuteList(node.children)
  File "/home/andy/git/oilshell/oil/bin/../core/cmd_exec.py", line 978, in _ExecuteList
    status = self._Execute(child)  # last status wins
  File "/home/andy/git/oilshell/oil/bin/../core/cmd_exec.py", line 949, in _Execute
    status, check_errexit = self._Dispatch(node, fork_external)
  File "/home/andy/git/oilshell/oil/bin/../core/cmd_exec.py", line 624, in _Dispatch
    argv = self.ev.EvalWordSequence(words)
  File "/home/andy/git/oilshell/oil/bin/../core/word_eval.py", line 1106, in EvalWordSequence
    return self._EvalWordSequence(words)
  File "/home/andy/git/oilshell/oil/bin/../core/word_eval.py", line 1086, in _EvalWordSequence
    args = self._EvalWordAndReframe(w)
  File "/home/andy/git/oilshell/oil/bin/../core/word_eval.py", line 1039, in _EvalWordAndReframe
    part_vals = self._EvalParts(word)
  File "/home/andy/git/oilshell/oil/bin/../core/word_eval.py", line 933, in _EvalParts
    for v in self.part_ev._EvalWordPart(p, quoted=quoted):
  File "/home/andy/git/oilshell/oil/bin/../core/word_eval.py", line 892, in _EvalWordPart
    return self._EvalBracedVarSub(part, quoted)
  File "/home/andy/git/oilshell/oil/bin/../core/word_eval.py", line 825, in _EvalBracedVarSub
    val = self._DecayArray(val)
  File "/home/andy/git/oilshell/oil/bin/../core/word_eval.py", line 632, in _DecayArray
    assert val.tag == value_e.StrArray, val
AssertionError: (Str s:2)
FATAL: couldn't import from app bundle '_bin/osh' (1)
Stripping the oil.ovm binary may cause this error.
See https://github.com/oilshell/oil/issues/47
osh6 Increment array variables

[osh stdout] Expected '2 2\n', got ''
[osh status] Expected 0, got 1

stdout:
stderr: 
Traceback (most recent call last):
  File "bin/osh", line 509, in <module>
    main(sys.argv)
  File "bin/osh", line 492, in main
    sys.exit(OilMain(argv))
  File "bin/osh", line 475, in OilMain
    status = OshMain(main_argv, login_shell)
  File "bin/osh", line 413, in OshMain
    status = ex.Execute(node)
  File "/home/andy/git/oilshell/oil/bin/../core/cmd_exec.py", line 985, in Execute
    status = self._Execute(node, fork_external=fork_external)
  File "/home/andy/git/oilshell/oil/bin/../core/cmd_exec.py", line 949, in _Execute
    status, check_errexit = self._Dispatch(node, fork_external)
  File "/home/andy/git/oilshell/oil/bin/../core/cmd_exec.py", line 758, in _Dispatch
    status = self._ExecuteList(node.children)
  File "/home/andy/git/oilshell/oil/bin/../core/cmd_exec.py", line 978, in _ExecuteList
    status = self._Execute(child)  # last status wins
  File "/home/andy/git/oilshell/oil/bin/../core/cmd_exec.py", line 949, in _Execute
    status, check_errexit = self._Dispatch(node, fork_external)
  File "/home/andy/git/oilshell/oil/bin/../core/cmd_exec.py", line 681, in _Dispatch
    i = self.arith_ev.Eval(node.child)
  File "/home/andy/git/oilshell/oil/bin/../core/expr_eval.py", line 262, in Eval
    new_int = old_int + 1
TypeError: can only concatenate list (not "int") to list
osh_ALT6 Increment array variables

[osh_ALT stdout] Expected '2 2\n', got ''
[osh_ALT status] Expected 0, got 1

stdout:
stderr: 
Traceback (most recent call last):
  File "/home/andy/git/oilshell/oil/Python-2.7.13/Lib/runpy.py", line 174, in _run_module_as_main
    "__main__", fname, loader, pkg_name)
  File "/home/andy/git/oilshell/oil/Python-2.7.13/Lib/runpy.py", line 72, in _run_code
    exec code in run_globals
  File "/home/andy/git/oilshell/oil/bin/oil.py", line 509, in <module>
    main(sys.argv)
  File "/home/andy/git/oilshell/oil/bin/oil.py", line 492, in main
    sys.exit(OilMain(argv))
  File "/home/andy/git/oilshell/oil/bin/oil.py", line 475, in OilMain
    status = OshMain(main_argv, login_shell)
  File "/home/andy/git/oilshell/oil/bin/oil.py", line 413, in OshMain
    status = ex.Execute(node)
  File "/home/andy/git/oilshell/oil/bin/../core/cmd_exec.py", line 985, in Execute
    status = self._Execute(node, fork_external=fork_external)
  File "/home/andy/git/oilshell/oil/bin/../core/cmd_exec.py", line 949, in _Execute
    status, check_errexit = self._Dispatch(node, fork_external)
  File "/home/andy/git/oilshell/oil/bin/../core/cmd_exec.py", line 758, in _Dispatch
    status = self._ExecuteList(node.children)
  File "/home/andy/git/oilshell/oil/bin/../core/cmd_exec.py", line 978, in _ExecuteList
    status = self._Execute(child)  # last status wins
  File "/home/andy/git/oilshell/oil/bin/../core/cmd_exec.py", line 949, in _Execute
    status, check_errexit = self._Dispatch(node, fork_external)
  File "/home/andy/git/oilshell/oil/bin/../core/cmd_exec.py", line 681, in _Dispatch
    i = self.arith_ev.Eval(node.child)
  File "/home/andy/git/oilshell/oil/bin/../core/expr_eval.py", line 262, in Eval
    new_int = old_int + 1
TypeError: can only concatenate list (not "int") to list
FATAL: couldn't import from app bundle '_bin/osh' (1)
Stripping the oil.ovm binary may cause this error.
See https://github.com/oilshell/oil/issues/47