Results for background.test.sh

statusoshosh_.pyosh_.cc
pass 1400
FAIL 21616
total161616
caseoshosh_.pyosh_.ccdescription
0pass FAIL FAIL wait with nothing to wait for
detailsdetails
1pass FAIL FAIL wait -n with nothing to wait for
detailsdetails
2FAIL FAIL FAIL wait with jobspec syntax %nonexistent
detailsdetailsdetails
3pass FAIL FAIL wait with invalid PID
detailsdetails
4pass FAIL FAIL wait with invalid arg
detailsdetails
5pass FAIL FAIL Builtin in background
detailsdetails
6pass FAIL FAIL External command in background
detailsdetails
7pass FAIL FAIL Pipeline in Background
detailsdetails
8FAIL FAIL FAIL Wait for job doesn't support PIPESTATUS
detailsdetailsdetails
9pass FAIL FAIL Brace group in background, wait all
detailsdetails
10pass FAIL FAIL Wait on background process PID
detailsdetails
11pass FAIL FAIL Wait on multiple specific IDs returns last status
detailsdetails
12pass FAIL FAIL wait -n
detailsdetails
13pass FAIL FAIL Async for loop
detailsdetails
14pass FAIL FAIL Background process doesn't affect parent
detailsdetails
15pass FAIL FAIL Background process and then a singleton pipeline
detailsdetails
14 passed, 0 OK, 0 not implemented, 0 BUG, 34 failed, 0 timeouts, 0 cases skipped
2 failed under osh

Details on runs that didn't PASS

osh_.py0 wait with nothing to wait for

[osh_.py status] Expected 0, got 1
[osh_.py stderr] Found 'Traceback (most recent'

stdout:
stderr: 
Traceback (most recent call last):
  File "/home/andy/git/oilshell/oil/bin/osh_eval.py", line 68, in <module>
    sys.exit(main(sys.argv))
  File "/home/andy/git/oilshell/oil/bin/osh_eval.py", line 36, in main
    None)
  File "/home/andy/git/oilshell/oil/core/shell_native.py", line 476, in Main
    cmd_flags=cmd_eval.IsMainProgram)
  File "/home/andy/git/oilshell/oil/core/main_loop.py", line 324, in Batch
    is_return, is_fatal = cmd_ev.ExecuteAndCatch(node, cmd_flags=cmd_flags)
  File "/home/andy/git/oilshell/oil/osh/cmd_eval.py", line 1498, in ExecuteAndCatch
    status = self._Execute(node)
  File "/home/andy/git/oilshell/oil/osh/cmd_eval.py", line 1345, in _Execute
    status, check_errexit = self._Dispatch(node, pipeline_st)
  File "/home/andy/git/oilshell/oil/osh/cmd_eval.py", line 623, in _Dispatch
    status = self._RunSimpleCommand(cmd_val, node.do_fork)
  File "/home/andy/git/oilshell/oil/osh/cmd_eval.py", line 477, in _RunSimpleCommand
    return self.shell_ex.RunSimpleCommand(cmd_val, do_fork)
  File "/home/andy/git/oilshell/oil/core/executor.py", line 230, in RunSimpleCommand
    return self.RunBuiltin(builtin_id, cmd_val)
  File "/home/andy/git/oilshell/oil/core/executor.py", line 121, in RunBuiltin
    builtin_func = self.builtins[builtin_id]
KeyError: 33
osh_.cc0 wait with nothing to wait for

[osh_.cc status] Expected 0, got -6

stdout:
stderr: 
osh_eval.opt: mycpp/mylib.h:674: V Dict<K, V>::index(K) [with K = int; V = vm::_Builtin*]: Assertion `0' failed.
osh_.py1 wait -n with nothing to wait for

[osh_.py status] Expected 127, got 1
[osh_.py stderr] Found 'Traceback (most recent'

stdout:
stderr: 
Traceback (most recent call last):
  File "/home/andy/git/oilshell/oil/bin/osh_eval.py", line 68, in <module>
    sys.exit(main(sys.argv))
  File "/home/andy/git/oilshell/oil/bin/osh_eval.py", line 36, in main
    None)
  File "/home/andy/git/oilshell/oil/core/shell_native.py", line 476, in Main
    cmd_flags=cmd_eval.IsMainProgram)
  File "/home/andy/git/oilshell/oil/core/main_loop.py", line 324, in Batch
    is_return, is_fatal = cmd_ev.ExecuteAndCatch(node, cmd_flags=cmd_flags)
  File "/home/andy/git/oilshell/oil/osh/cmd_eval.py", line 1498, in ExecuteAndCatch
    status = self._Execute(node)
  File "/home/andy/git/oilshell/oil/osh/cmd_eval.py", line 1345, in _Execute
    status, check_errexit = self._Dispatch(node, pipeline_st)
  File "/home/andy/git/oilshell/oil/osh/cmd_eval.py", line 623, in _Dispatch
    status = self._RunSimpleCommand(cmd_val, node.do_fork)
  File "/home/andy/git/oilshell/oil/osh/cmd_eval.py", line 477, in _RunSimpleCommand
    return self.shell_ex.RunSimpleCommand(cmd_val, do_fork)
  File "/home/andy/git/oilshell/oil/core/executor.py", line 230, in RunSimpleCommand
    return self.RunBuiltin(builtin_id, cmd_val)
  File "/home/andy/git/oilshell/oil/core/executor.py", line 121, in RunBuiltin
    builtin_func = self.builtins[builtin_id]
KeyError: 33
osh_.cc1 wait -n with nothing to wait for

[osh_.cc status] Expected 127, got -6

stdout:
stderr: 
osh_eval.opt: mycpp/mylib.h:674: V Dict<K, V>::index(K) [with K = int; V = vm::_Builtin*]: Assertion `0' failed.
osh2 wait with jobspec syntax %nonexistent

[osh status] Expected 127, got 2

stdout:
stderr: 
  wait %nonexistent
       ^
[ stdin ]:1: 'wait' doesn't support bash-style jobspecs (got '%nonexistent')
osh_.py2 wait with jobspec syntax %nonexistent

[osh_.py status] Expected 127, got 1
[osh_.py stderr] Found 'Traceback (most recent'

stdout:
stderr: 
Traceback (most recent call last):
  File "/home/andy/git/oilshell/oil/bin/osh_eval.py", line 68, in <module>
    sys.exit(main(sys.argv))
  File "/home/andy/git/oilshell/oil/bin/osh_eval.py", line 36, in main
    None)
  File "/home/andy/git/oilshell/oil/core/shell_native.py", line 476, in Main
    cmd_flags=cmd_eval.IsMainProgram)
  File "/home/andy/git/oilshell/oil/core/main_loop.py", line 324, in Batch
    is_return, is_fatal = cmd_ev.ExecuteAndCatch(node, cmd_flags=cmd_flags)
  File "/home/andy/git/oilshell/oil/osh/cmd_eval.py", line 1498, in ExecuteAndCatch
    status = self._Execute(node)
  File "/home/andy/git/oilshell/oil/osh/cmd_eval.py", line 1345, in _Execute
    status, check_errexit = self._Dispatch(node, pipeline_st)
  File "/home/andy/git/oilshell/oil/osh/cmd_eval.py", line 623, in _Dispatch
    status = self._RunSimpleCommand(cmd_val, node.do_fork)
  File "/home/andy/git/oilshell/oil/osh/cmd_eval.py", line 477, in _RunSimpleCommand
    return self.shell_ex.RunSimpleCommand(cmd_val, do_fork)
  File "/home/andy/git/oilshell/oil/core/executor.py", line 230, in RunSimpleCommand
    return self.RunBuiltin(builtin_id, cmd_val)
  File "/home/andy/git/oilshell/oil/core/executor.py", line 121, in RunBuiltin
    builtin_func = self.builtins[builtin_id]
KeyError: 33
osh_.cc2 wait with jobspec syntax %nonexistent

[osh_.cc status] Expected 127, got -6

stdout:
stderr: 
osh_eval.opt: mycpp/mylib.h:674: V Dict<K, V>::index(K) [with K = int; V = vm::_Builtin*]: Assertion `0' failed.
osh_.py3 wait with invalid PID

[osh_.py status] Expected 127, got 1
[osh_.py stderr] Found 'Traceback (most recent'

stdout:
stderr: 
Traceback (most recent call last):
  File "/home/andy/git/oilshell/oil/bin/osh_eval.py", line 68, in <module>
    sys.exit(main(sys.argv))
  File "/home/andy/git/oilshell/oil/bin/osh_eval.py", line 36, in main
    None)
  File "/home/andy/git/oilshell/oil/core/shell_native.py", line 476, in Main
    cmd_flags=cmd_eval.IsMainProgram)
  File "/home/andy/git/oilshell/oil/core/main_loop.py", line 324, in Batch
    is_return, is_fatal = cmd_ev.ExecuteAndCatch(node, cmd_flags=cmd_flags)
  File "/home/andy/git/oilshell/oil/osh/cmd_eval.py", line 1498, in ExecuteAndCatch
    status = self._Execute(node)
  File "/home/andy/git/oilshell/oil/osh/cmd_eval.py", line 1345, in _Execute
    status, check_errexit = self._Dispatch(node, pipeline_st)
  File "/home/andy/git/oilshell/oil/osh/cmd_eval.py", line 623, in _Dispatch
    status = self._RunSimpleCommand(cmd_val, node.do_fork)
  File "/home/andy/git/oilshell/oil/osh/cmd_eval.py", line 477, in _RunSimpleCommand
    return self.shell_ex.RunSimpleCommand(cmd_val, do_fork)
  File "/home/andy/git/oilshell/oil/core/executor.py", line 230, in RunSimpleCommand
    return self.RunBuiltin(builtin_id, cmd_val)
  File "/home/andy/git/oilshell/oil/core/executor.py", line 121, in RunBuiltin
    builtin_func = self.builtins[builtin_id]
KeyError: 33
osh_.cc3 wait with invalid PID

[osh_.cc status] Expected 127, got -6

stdout:
stderr: 
osh_eval.opt: mycpp/mylib.h:674: V Dict<K, V>::index(K) [with K = int; V = vm::_Builtin*]: Assertion `0' failed.
osh_.py4 wait with invalid arg

[osh_.py status] Expected 2, got 1
[osh_.py stderr] Found 'Traceback (most recent'

stdout:
stderr: 
Traceback (most recent call last):
  File "/home/andy/git/oilshell/oil/bin/osh_eval.py", line 68, in <module>
    sys.exit(main(sys.argv))
  File "/home/andy/git/oilshell/oil/bin/osh_eval.py", line 36, in main
    None)
  File "/home/andy/git/oilshell/oil/core/shell_native.py", line 476, in Main
    cmd_flags=cmd_eval.IsMainProgram)
  File "/home/andy/git/oilshell/oil/core/main_loop.py", line 324, in Batch
    is_return, is_fatal = cmd_ev.ExecuteAndCatch(node, cmd_flags=cmd_flags)
  File "/home/andy/git/oilshell/oil/osh/cmd_eval.py", line 1498, in ExecuteAndCatch
    status = self._Execute(node)
  File "/home/andy/git/oilshell/oil/osh/cmd_eval.py", line 1345, in _Execute
    status, check_errexit = self._Dispatch(node, pipeline_st)
  File "/home/andy/git/oilshell/oil/osh/cmd_eval.py", line 623, in _Dispatch
    status = self._RunSimpleCommand(cmd_val, node.do_fork)
  File "/home/andy/git/oilshell/oil/osh/cmd_eval.py", line 477, in _RunSimpleCommand
    return self.shell_ex.RunSimpleCommand(cmd_val, do_fork)
  File "/home/andy/git/oilshell/oil/core/executor.py", line 230, in RunSimpleCommand
    return self.RunBuiltin(builtin_id, cmd_val)
  File "/home/andy/git/oilshell/oil/core/executor.py", line 121, in RunBuiltin
    builtin_func = self.builtins[builtin_id]
KeyError: 33
osh_.cc4 wait with invalid arg

[osh_.cc status] Expected 2, got -6

stdout:
stderr: 
osh_eval.opt: mycpp/mylib.h:674: V Dict<K, V>::index(K) [with K = int; V = vm::_Builtin*]: Assertion `0' failed.
osh_.py5 Builtin in background

[osh_.py status] Expected 0, got 1
[osh_.py stderr] Found 'Traceback (most recent'

stdout:
async
stderr:
Traceback (most recent call last):
  File "/home/andy/git/oilshell/oil/bin/osh_eval.py", line 68, in <module>
    sys.exit(main(sys.argv))
  File "/home/andy/git/oilshell/oil/bin/osh_eval.py", line 36, in main
    None)
  File "/home/andy/git/oilshell/oil/core/shell_native.py", line 476, in Main
    cmd_flags=cmd_eval.IsMainProgram)
  File "/home/andy/git/oilshell/oil/core/main_loop.py", line 324, in Batch
    is_return, is_fatal = cmd_ev.ExecuteAndCatch(node, cmd_flags=cmd_flags)
  File "/home/andy/git/oilshell/oil/osh/cmd_eval.py", line 1498, in ExecuteAndCatch
    status = self._Execute(node)
  File "/home/andy/git/oilshell/oil/osh/cmd_eval.py", line 1345, in _Execute
    status, check_errexit = self._Dispatch(node, pipeline_st)
  File "/home/andy/git/oilshell/oil/osh/cmd_eval.py", line 623, in _Dispatch
    status = self._RunSimpleCommand(cmd_val, node.do_fork)
  File "/home/andy/git/oilshell/oil/osh/cmd_eval.py", line 477, in _RunSimpleCommand
    return self.shell_ex.RunSimpleCommand(cmd_val, do_fork)
  File "/home/andy/git/oilshell/oil/core/executor.py", line 230, in RunSimpleCommand
    return self.RunBuiltin(builtin_id, cmd_val)
  File "/home/andy/git/oilshell/oil/core/executor.py", line 121, in RunBuiltin
    builtin_func = self.builtins[builtin_id]
KeyError: 33
osh_.cc5 Builtin in background

[osh_.cc status] Expected 0, got -6

stdout:
async
stderr:
osh_eval.opt: mycpp/mylib.h:674: V Dict<K, V>::index(K) [with K = int; V = vm::_Builtin*]: Assertion `0' failed.
osh_.py6 External command in background

[osh_.py status] Expected 0, got 1
[osh_.py stderr] Found 'Traceback (most recent'

stdout:
stderr: 
Traceback (most recent call last):
  File "/home/andy/git/oilshell/oil/bin/osh_eval.py", line 68, in <module>
    sys.exit(main(sys.argv))
  File "/home/andy/git/oilshell/oil/bin/osh_eval.py", line 36, in main
    None)
  File "/home/andy/git/oilshell/oil/core/shell_native.py", line 476, in Main
    cmd_flags=cmd_eval.IsMainProgram)
  File "/home/andy/git/oilshell/oil/core/main_loop.py", line 324, in Batch
    is_return, is_fatal = cmd_ev.ExecuteAndCatch(node, cmd_flags=cmd_flags)
  File "/home/andy/git/oilshell/oil/osh/cmd_eval.py", line 1498, in ExecuteAndCatch
    status = self._Execute(node)
  File "/home/andy/git/oilshell/oil/osh/cmd_eval.py", line 1345, in _Execute
    status, check_errexit = self._Dispatch(node, pipeline_st)
  File "/home/andy/git/oilshell/oil/osh/cmd_eval.py", line 623, in _Dispatch
    status = self._RunSimpleCommand(cmd_val, node.do_fork)
  File "/home/andy/git/oilshell/oil/osh/cmd_eval.py", line 477, in _RunSimpleCommand
    return self.shell_ex.RunSimpleCommand(cmd_val, do_fork)
  File "/home/andy/git/oilshell/oil/core/executor.py", line 230, in RunSimpleCommand
    return self.RunBuiltin(builtin_id, cmd_val)
  File "/home/andy/git/oilshell/oil/core/executor.py", line 121, in RunBuiltin
    builtin_func = self.builtins[builtin_id]
KeyError: 33
osh_.cc6 External command in background

[osh_.cc status] Expected 0, got -6

stdout:
stderr: 
osh_eval.opt: mycpp/mylib.h:674: V Dict<K, V>::index(K) [with K = int; V = vm::_Builtin*]: Assertion `0' failed.
osh_.py7 Pipeline in Background

[osh_.py stdout] Expected 'status=99\n', got ''
[osh_.py status] Expected 0, got 1
[osh_.py stderr] Found 'Traceback (most recent'

stdout:
stderr: 
Traceback (most recent call last):
  File "/home/andy/git/oilshell/oil/bin/osh_eval.py", line 68, in <module>
    sys.exit(main(sys.argv))
  File "/home/andy/git/oilshell/oil/bin/osh_eval.py", line 36, in main
    None)
  File "/home/andy/git/oilshell/oil/core/shell_native.py", line 476, in Main
    cmd_flags=cmd_eval.IsMainProgram)
  File "/home/andy/git/oilshell/oil/core/main_loop.py", line 324, in Batch
    is_return, is_fatal = cmd_ev.ExecuteAndCatch(node, cmd_flags=cmd_flags)
  File "/home/andy/git/oilshell/oil/osh/cmd_eval.py", line 1498, in ExecuteAndCatch
    status = self._Execute(node)
  File "/home/andy/git/oilshell/oil/osh/cmd_eval.py", line 1345, in _Execute
    status, check_errexit = self._Dispatch(node, pipeline_st)
  File "/home/andy/git/oilshell/oil/osh/cmd_eval.py", line 623, in _Dispatch
    status = self._RunSimpleCommand(cmd_val, node.do_fork)
  File "/home/andy/git/oilshell/oil/osh/cmd_eval.py", line 477, in _RunSimpleCommand
    return self.shell_ex.RunSimpleCommand(cmd_val, do_fork)
  File "/home/andy/git/oilshell/oil/core/executor.py", line 230, in RunSimpleCommand
    return self.RunBuiltin(builtin_id, cmd_val)
  File "/home/andy/git/oilshell/oil/core/executor.py", line 121, in RunBuiltin
    builtin_func = self.builtins[builtin_id]
KeyError: 33
osh_.cc7 Pipeline in Background

[osh_.cc stdout] Expected 'status=99\n', got ''
[osh_.cc status] Expected 0, got -6

stdout:
stderr: 
osh_eval.opt: cpp/posix.h:106: Tuple2<int, int> posix::pipe(): Assertion `0' failed.
osh8 Wait for job doesn't support PIPESTATUS

[osh stdout] Expected 'status=1 pipestatus=55 1\nstatus=0 pipestatus=0\nstatus=1 pipestatus=1\n', got 'status=1 pipestatus=141 1\nstatus=0 pipestatus=141 1\nstatus=2 pipestatus=141 1\n'

stdout:
status=1 pipestatus=141 1
status=0 pipestatus=141 1
status=2 pipestatus=141 1
stderr:
  wait %+
       ^
[ stdin ]:5: 'wait' doesn't support bash-style jobspecs (got '%+')
osh_.py8 Wait for job doesn't support PIPESTATUS

[osh_.py stdout] Expected 'status=1 pipestatus=55 1\nstatus=0 pipestatus=0\nstatus=1 pipestatus=1\n', got 'status=1 pipestatus=141 1\nstatus=0 pipestatus=141 1\n'
[osh_.py status] Expected 0, got 1
[osh_.py stderr] Found 'Traceback (most recent'

stdout:
status=1 pipestatus=141 1
status=0 pipestatus=141 1
stderr:
Traceback (most recent call last):
  File "/home/andy/git/oilshell/oil/bin/osh_eval.py", line 68, in <module>
    sys.exit(main(sys.argv))
  File "/home/andy/git/oilshell/oil/bin/osh_eval.py", line 36, in main
    None)
  File "/home/andy/git/oilshell/oil/core/shell_native.py", line 476, in Main
    cmd_flags=cmd_eval.IsMainProgram)
  File "/home/andy/git/oilshell/oil/core/main_loop.py", line 324, in Batch
    is_return, is_fatal = cmd_ev.ExecuteAndCatch(node, cmd_flags=cmd_flags)
  File "/home/andy/git/oilshell/oil/osh/cmd_eval.py", line 1498, in ExecuteAndCatch
    status = self._Execute(node)
  File "/home/andy/git/oilshell/oil/osh/cmd_eval.py", line 1345, in _Execute
    status, check_errexit = self._Dispatch(node, pipeline_st)
  File "/home/andy/git/oilshell/oil/osh/cmd_eval.py", line 623, in _Dispatch
    status = self._RunSimpleCommand(cmd_val, node.do_fork)
  File "/home/andy/git/oilshell/oil/osh/cmd_eval.py", line 477, in _RunSimpleCommand
    return self.shell_ex.RunSimpleCommand(cmd_val, do_fork)
  File "/home/andy/git/oilshell/oil/core/executor.py", line 230, in RunSimpleCommand
    return self.RunBuiltin(builtin_id, cmd_val)
  File "/home/andy/git/oilshell/oil/core/executor.py", line 121, in RunBuiltin
    builtin_func = self.builtins[builtin_id]
KeyError: 33
osh_.cc8 Wait for job doesn't support PIPESTATUS

[osh_.cc stdout] Expected 'status=1 pipestatus=55 1\nstatus=0 pipestatus=0\nstatus=1 pipestatus=1\n', got ''
[osh_.cc status] Expected 0, got -6

stdout:
stderr: 
osh_eval.opt: cpp/posix.h:106: Tuple2<int, int> posix::pipe(): Assertion `0' failed.
osh_.py9 Brace group in background, wait all

[osh_.py stdout] Expected 'status=0\n', got ''
[osh_.py status] Expected 0, got 1
[osh_.py stderr] Found 'Traceback (most recent'

stdout:
stderr: 
Traceback (most recent call last):
  File "/home/andy/git/oilshell/oil/bin/osh_eval.py", line 68, in <module>
    sys.exit(main(sys.argv))
  File "/home/andy/git/oilshell/oil/bin/osh_eval.py", line 36, in main
    None)
  File "/home/andy/git/oilshell/oil/core/shell_native.py", line 476, in Main
    cmd_flags=cmd_eval.IsMainProgram)
  File "/home/andy/git/oilshell/oil/core/main_loop.py", line 324, in Batch
    is_return, is_fatal = cmd_ev.ExecuteAndCatch(node, cmd_flags=cmd_flags)
  File "/home/andy/git/oilshell/oil/osh/cmd_eval.py", line 1498, in ExecuteAndCatch
    status = self._Execute(node)
  File "/home/andy/git/oilshell/oil/osh/cmd_eval.py", line 1345, in _Execute
    status, check_errexit = self._Dispatch(node, pipeline_st)
  File "/home/andy/git/oilshell/oil/osh/cmd_eval.py", line 623, in _Dispatch
    status = self._RunSimpleCommand(cmd_val, node.do_fork)
  File "/home/andy/git/oilshell/oil/osh/cmd_eval.py", line 477, in _RunSimpleCommand
    return self.shell_ex.RunSimpleCommand(cmd_val, do_fork)
  File "/home/andy/git/oilshell/oil/core/executor.py", line 230, in RunSimpleCommand
    return self.RunBuiltin(builtin_id, cmd_val)
  File "/home/andy/git/oilshell/oil/core/executor.py", line 121, in RunBuiltin
    builtin_func = self.builtins[builtin_id]
KeyError: 33
osh_.cc9 Brace group in background, wait all

[osh_.cc stdout] Expected 'status=0\n', got ''
[osh_.cc status] Expected 0, got -6

stdout:
stderr: 
osh_eval.opt: mycpp/mylib.h:674: V Dict<K, V>::index(K) [with K = int; V = vm::_Builtin*]: Assertion `0' failed.
osh_.py10 Wait on background process PID

[osh_.py stdout] Expected u'status=9\nstatus=7\n', got ''
[osh_.py status] Expected 0, got 1
[osh_.py stderr] Found 'Traceback (most recent'

stdout:
stderr: 
Traceback (most recent call last):
  File "/home/andy/git/oilshell/oil/bin/osh_eval.py", line 68, in <module>
    sys.exit(main(sys.argv))
  File "/home/andy/git/oilshell/oil/bin/osh_eval.py", line 36, in main
    None)
  File "/home/andy/git/oilshell/oil/core/shell_native.py", line 476, in Main
    cmd_flags=cmd_eval.IsMainProgram)
  File "/home/andy/git/oilshell/oil/core/main_loop.py", line 324, in Batch
    is_return, is_fatal = cmd_ev.ExecuteAndCatch(node, cmd_flags=cmd_flags)
  File "/home/andy/git/oilshell/oil/osh/cmd_eval.py", line 1498, in ExecuteAndCatch
    status = self._Execute(node)
  File "/home/andy/git/oilshell/oil/osh/cmd_eval.py", line 1345, in _Execute
    status, check_errexit = self._Dispatch(node, pipeline_st)
  File "/home/andy/git/oilshell/oil/osh/cmd_eval.py", line 623, in _Dispatch
    status = self._RunSimpleCommand(cmd_val, node.do_fork)
  File "/home/andy/git/oilshell/oil/osh/cmd_eval.py", line 477, in _RunSimpleCommand
    return self.shell_ex.RunSimpleCommand(cmd_val, do_fork)
  File "/home/andy/git/oilshell/oil/core/executor.py", line 230, in RunSimpleCommand
    return self.RunBuiltin(builtin_id, cmd_val)
  File "/home/andy/git/oilshell/oil/core/executor.py", line 121, in RunBuiltin
    builtin_func = self.builtins[builtin_id]
KeyError: 33
osh_.cc10 Wait on background process PID

[osh_.cc stdout] Expected u'status=9\nstatus=7\n', got ''
[osh_.cc status] Expected 0, got -6

stdout:
stderr: 
osh_eval.opt: mycpp/mylib.h:674: V Dict<K, V>::index(K) [with K = int; V = vm::_Builtin*]: Assertion `0' failed.
osh_.py11 Wait on multiple specific IDs returns last status

[osh_.py stdout] Expected 'status=7\n', got ''
[osh_.py status] Expected 0, got 1
[osh_.py stderr] Found 'Traceback (most recent'

stdout:
stderr: 
Traceback (most recent call last):
  File "/home/andy/git/oilshell/oil/bin/osh_eval.py", line 68, in <module>
    sys.exit(main(sys.argv))
  File "/home/andy/git/oilshell/oil/bin/osh_eval.py", line 36, in main
    None)
  File "/home/andy/git/oilshell/oil/core/shell_native.py", line 476, in Main
    cmd_flags=cmd_eval.IsMainProgram)
  File "/home/andy/git/oilshell/oil/core/main_loop.py", line 324, in Batch
    is_return, is_fatal = cmd_ev.ExecuteAndCatch(node, cmd_flags=cmd_flags)
  File "/home/andy/git/oilshell/oil/osh/cmd_eval.py", line 1498, in ExecuteAndCatch
    status = self._Execute(node)
  File "/home/andy/git/oilshell/oil/osh/cmd_eval.py", line 1345, in _Execute
    status, check_errexit = self._Dispatch(node, pipeline_st)
  File "/home/andy/git/oilshell/oil/osh/cmd_eval.py", line 623, in _Dispatch
    status = self._RunSimpleCommand(cmd_val, node.do_fork)
  File "/home/andy/git/oilshell/oil/osh/cmd_eval.py", line 477, in _RunSimpleCommand
    return self.shell_ex.RunSimpleCommand(cmd_val, do_fork)
  File "/home/andy/git/oilshell/oil/core/executor.py", line 230, in RunSimpleCommand
    return self.RunBuiltin(builtin_id, cmd_val)
  File "/home/andy/git/oilshell/oil/core/executor.py", line 121, in RunBuiltin
    builtin_func = self.builtins[builtin_id]
KeyError: 33
osh_.cc11 Wait on multiple specific IDs returns last status

[osh_.cc stdout] Expected 'status=7\n', got ''
[osh_.cc status] Expected 0, got -6

stdout:
stderr: 
osh_eval.opt: mycpp/mylib.h:674: V Dict<K, V>::index(K) [with K = int; V = vm::_Builtin*]: Assertion `0' failed.
osh_.py12 wait -n

[osh_.py stdout] Expected u'status=3\nstatus=9\n', got ''
[osh_.py status] Expected 0, got 1
[osh_.py stderr] Found 'Traceback (most recent'

stdout:
stderr: 
Traceback (most recent call last):
  File "/home/andy/git/oilshell/oil/bin/osh_eval.py", line 68, in <module>
    sys.exit(main(sys.argv))
  File "/home/andy/git/oilshell/oil/bin/osh_eval.py", line 36, in main
    None)
  File "/home/andy/git/oilshell/oil/core/shell_native.py", line 476, in Main
    cmd_flags=cmd_eval.IsMainProgram)
  File "/home/andy/git/oilshell/oil/core/main_loop.py", line 324, in Batch
    is_return, is_fatal = cmd_ev.ExecuteAndCatch(node, cmd_flags=cmd_flags)
  File "/home/andy/git/oilshell/oil/osh/cmd_eval.py", line 1498, in ExecuteAndCatch
    status = self._Execute(node)
  File "/home/andy/git/oilshell/oil/osh/cmd_eval.py", line 1345, in _Execute
    status, check_errexit = self._Dispatch(node, pipeline_st)
  File "/home/andy/git/oilshell/oil/osh/cmd_eval.py", line 623, in _Dispatch
    status = self._RunSimpleCommand(cmd_val, node.do_fork)
  File "/home/andy/git/oilshell/oil/osh/cmd_eval.py", line 477, in _RunSimpleCommand
    return self.shell_ex.RunSimpleCommand(cmd_val, do_fork)
  File "/home/andy/git/oilshell/oil/core/executor.py", line 230, in RunSimpleCommand
    return self.RunBuiltin(builtin_id, cmd_val)
  File "/home/andy/git/oilshell/oil/core/executor.py", line 121, in RunBuiltin
    builtin_func = self.builtins[builtin_id]
KeyError: 33
osh_.cc12 wait -n

[osh_.cc stdout] Expected u'status=3\nstatus=9\n', got ''
[osh_.cc status] Expected 0, got -6

stdout:
stderr: 
osh_eval.opt: mycpp/mylib.h:674: V Dict<K, V>::index(K) [with K = int; V = vm::_Builtin*]: Assertion `0' failed.
osh_.py13 Async for loop

[osh_.py status] Expected 0, got 1
[osh_.py stderr] Found 'Traceback (most recent'

stdout:
1
2
3
stderr:
Traceback (most recent call last):
  File "/home/andy/git/oilshell/oil/bin/osh_eval.py", line 68, in <module>
    sys.exit(main(sys.argv))
  File "/home/andy/git/oilshell/oil/bin/osh_eval.py", line 36, in main
    None)
  File "/home/andy/git/oilshell/oil/core/shell_native.py", line 476, in Main
    cmd_flags=cmd_eval.IsMainProgram)
  File "/home/andy/git/oilshell/oil/core/main_loop.py", line 324, in Batch
    is_return, is_fatal = cmd_ev.ExecuteAndCatch(node, cmd_flags=cmd_flags)
  File "/home/andy/git/oilshell/oil/osh/cmd_eval.py", line 1498, in ExecuteAndCatch
    status = self._Execute(node)
  File "/home/andy/git/oilshell/oil/osh/cmd_eval.py", line 1345, in _Execute
    status, check_errexit = self._Dispatch(node, pipeline_st)
  File "/home/andy/git/oilshell/oil/osh/cmd_eval.py", line 623, in _Dispatch
    status = self._RunSimpleCommand(cmd_val, node.do_fork)
  File "/home/andy/git/oilshell/oil/osh/cmd_eval.py", line 477, in _RunSimpleCommand
    return self.shell_ex.RunSimpleCommand(cmd_val, do_fork)
  File "/home/andy/git/oilshell/oil/core/executor.py", line 230, in RunSimpleCommand
    return self.RunBuiltin(builtin_id, cmd_val)
  File "/home/andy/git/oilshell/oil/core/executor.py", line 121, in RunBuiltin
    builtin_func = self.builtins[builtin_id]
KeyError: 33
osh_.cc13 Async for loop

[osh_.cc status] Expected 0, got -6

stdout:
1
2
3
stderr:
osh_eval.opt: mycpp/mylib.h:674: V Dict<K, V>::index(K) [with K = int; V = vm::_Builtin*]: Assertion `0' failed.
osh_.py14 Background process doesn't affect parent

[osh_.py stdout] Expected u'1\n1\n2\n\n', got '1\n1\n2\n'
[osh_.py status] Expected 0, got 1
[osh_.py stderr] Found 'Traceback (most recent'

stdout:
1
1
2
stderr:
Traceback (most recent call last):
  File "/home/andy/git/oilshell/oil/bin/osh_eval.py", line 68, in <module>
    sys.exit(main(sys.argv))
  File "/home/andy/git/oilshell/oil/bin/osh_eval.py", line 36, in main
    None)
  File "/home/andy/git/oilshell/oil/core/shell_native.py", line 476, in Main
    cmd_flags=cmd_eval.IsMainProgram)
  File "/home/andy/git/oilshell/oil/core/main_loop.py", line 324, in Batch
    is_return, is_fatal = cmd_ev.ExecuteAndCatch(node, cmd_flags=cmd_flags)
  File "/home/andy/git/oilshell/oil/osh/cmd_eval.py", line 1498, in ExecuteAndCatch
    status = self._Execute(node)
  File "/home/andy/git/oilshell/oil/osh/cmd_eval.py", line 1345, in _Execute
    status, check_errexit = self._Dispatch(node, pipeline_st)
  File "/home/andy/git/oilshell/oil/osh/cmd_eval.py", line 623, in _Dispatch
    status = self._RunSimpleCommand(cmd_val, node.do_fork)
  File "/home/andy/git/oilshell/oil/osh/cmd_eval.py", line 477, in _RunSimpleCommand
    return self.shell_ex.RunSimpleCommand(cmd_val, do_fork)
  File "/home/andy/git/oilshell/oil/core/executor.py", line 230, in RunSimpleCommand
    return self.RunBuiltin(builtin_id, cmd_val)
  File "/home/andy/git/oilshell/oil/core/executor.py", line 121, in RunBuiltin
    builtin_func = self.builtins[builtin_id]
KeyError: 33
osh_.cc14 Background process doesn't affect parent

[osh_.cc stdout] Expected u'1\n1\n2\n\n', got '1\n1\n2\n'
[osh_.cc status] Expected 0, got -6

stdout:
1
1
2
stderr:
osh_eval.opt: mycpp/mylib.h:674: V Dict<K, V>::index(K) [with K = int; V = vm::_Builtin*]: Assertion `0' failed.
osh_.py15 Background process and then a singleton pipeline

[osh_.py stdout] Expected 'begin\nend\nstatus=42\n', got 'begin\nend\n'
[osh_.py status] Expected 0, got 1
[osh_.py stderr] Found 'Traceback (most recent'

stdout:
begin
end
stderr:
Traceback (most recent call last):
  File "/home/andy/git/oilshell/oil/bin/osh_eval.py", line 68, in <module>
    sys.exit(main(sys.argv))
  File "/home/andy/git/oilshell/oil/bin/osh_eval.py", line 36, in main
    None)
  File "/home/andy/git/oilshell/oil/core/shell_native.py", line 476, in Main
    cmd_flags=cmd_eval.IsMainProgram)
  File "/home/andy/git/oilshell/oil/core/main_loop.py", line 324, in Batch
    is_return, is_fatal = cmd_ev.ExecuteAndCatch(node, cmd_flags=cmd_flags)
  File "/home/andy/git/oilshell/oil/osh/cmd_eval.py", line 1498, in ExecuteAndCatch
    status = self._Execute(node)
  File "/home/andy/git/oilshell/oil/osh/cmd_eval.py", line 1345, in _Execute
    status, check_errexit = self._Dispatch(node, pipeline_st)
  File "/home/andy/git/oilshell/oil/osh/cmd_eval.py", line 623, in _Dispatch
    status = self._RunSimpleCommand(cmd_val, node.do_fork)
  File "/home/andy/git/oilshell/oil/osh/cmd_eval.py", line 477, in _RunSimpleCommand
    return self.shell_ex.RunSimpleCommand(cmd_val, do_fork)
  File "/home/andy/git/oilshell/oil/core/executor.py", line 230, in RunSimpleCommand
    return self.RunBuiltin(builtin_id, cmd_val)
  File "/home/andy/git/oilshell/oil/core/executor.py", line 121, in RunBuiltin
    builtin_func = self.builtins[builtin_id]
KeyError: 33
osh_.cc15 Background process and then a singleton pipeline

[osh_.cc stdout] Expected 'begin\nend\nstatus=42\n', got ''
[osh_.cc status] Expected 0, got -6

stdout:
stderr: 
osh_eval.opt: mycpp/mylib.h:674: V Dict<K, V>::index(K) [with K = int; V = vm::_Builtin*]: Assertion `0' failed.