Results for builtin-completion.test.sh

statusoshosh_.pyosh_.cc
pass 3600
FAIL 13737
total373737
caseoshosh_.pyosh_.ccdescription
0pass FAIL FAIL -A function prints functions
detailsdetails
1pass FAIL FAIL Invalid syntax
detailsdetails
2pass FAIL FAIL how compgen calls completion functions
detailsdetails
3pass FAIL FAIL complete -o -F (git)
detailsdetails
4pass FAIL FAIL compopt with invalid syntax
detailsdetails
5pass FAIL FAIL compopt fails when not in completion function
detailsdetails
6pass FAIL FAIL compgen -f on invalid dir
detailsdetails
7pass FAIL FAIL compgen -f
detailsdetails
8pass FAIL FAIL compgen -v with local vars
detailsdetails
9pass FAIL FAIL compgen -v on unknown var
detailsdetails
10pass FAIL FAIL compgen -v P
detailsdetails
11pass FAIL FAIL compgen with actions: function / variable / file
detailsdetails
12pass FAIL FAIL compgen with actions: alias, setopt
detailsdetails
13pass FAIL FAIL compgen with actions: shopt
detailsdetails
14pass FAIL FAIL compgen with action and suffix: helptopic
detailsdetails
15pass FAIL FAIL compgen -A directory
detailsdetails
16pass FAIL FAIL compgen -A file
detailsdetails
17pass FAIL FAIL compgen -A user
detailsdetails
18pass FAIL FAIL compgen -A command completes external commands
detailsdetails
19pass FAIL FAIL compgen -A command completes functions and aliases
detailsdetails
20pass FAIL FAIL compgen -A command completes builtins and keywords
detailsdetails
21pass FAIL FAIL complete with nonexistent function
detailsdetails
22pass FAIL FAIL complete with no action
detailsdetails
23pass FAIL FAIL -o filenames and -o nospace have no effect with compgen
detailsdetails
24pass FAIL FAIL -o plusdirs and -o dirnames with compgen
detailsdetails
25pass FAIL FAIL compgen -o default completes files and dirs
detailsdetails
26pass FAIL FAIL compgen doesn't respect -X for user-defined functions
detailsdetails
27pass FAIL FAIL compgen -W words -X filter
detailsdetails
28pass FAIL FAIL compgen -f -X filter -- $cur
detailsdetails
29pass FAIL FAIL compgen doesn't need shell quoting
detailsdetails
30pass FAIL FAIL compgen -W 'one two three'
detailsdetails
31pass FAIL FAIL compgen -W evaluates code in $()
detailsdetails
32pass FAIL FAIL compgen -W uses IFS, and delimiters are escaped with \
detailsdetails
33pass FAIL FAIL Parse errors for compgen -W and complete -W
detailsdetails
34pass FAIL FAIL Runtime errors for compgen -W
detailsdetails
35FAIL FAIL FAIL Runtime errors for compgen -F func
detailsdetailsdetails
36pass FAIL FAIL compgen -W '' cmd is not a usage error
detailsdetails
36 passed, 0 OK, 0 not implemented, 0 BUG, 75 failed, 0 timeouts, 0 cases skipped
1 failed under osh

Details on runs that didn't PASS

osh_.py0 -A function prints functions

[osh_.py stdout] Expected '__ec\n_ab\nadd\ndiv\nek\n--\n__ec\n_ab\n', got ''
[osh_.py status] Expected 0, got 1
[osh_.py stderr] Found 'Traceback (most recent'

stdout:
stderr: 
Traceback (most recent call last):
  File "/home/andy/git/oilshell/oil/bin/osh_eval.py", line 68, in <module>
    sys.exit(main(sys.argv))
  File "/home/andy/git/oilshell/oil/bin/osh_eval.py", line 36, in main
    None)
  File "/home/andy/git/oilshell/oil/core/shell_native.py", line 476, in Main
    cmd_flags=cmd_eval.IsMainProgram)
  File "/home/andy/git/oilshell/oil/core/main_loop.py", line 324, in Batch
    is_return, is_fatal = cmd_ev.ExecuteAndCatch(node, cmd_flags=cmd_flags)
  File "/home/andy/git/oilshell/oil/osh/cmd_eval.py", line 1498, in ExecuteAndCatch
    status = self._Execute(node)
  File "/home/andy/git/oilshell/oil/osh/cmd_eval.py", line 1345, in _Execute
    status, check_errexit = self._Dispatch(node, pipeline_st)
  File "/home/andy/git/oilshell/oil/osh/cmd_eval.py", line 623, in _Dispatch
    status = self._RunSimpleCommand(cmd_val, node.do_fork)
  File "/home/andy/git/oilshell/oil/osh/cmd_eval.py", line 477, in _RunSimpleCommand
    return self.shell_ex.RunSimpleCommand(cmd_val, do_fork)
  File "/home/andy/git/oilshell/oil/core/executor.py", line 230, in RunSimpleCommand
    return self.RunBuiltin(builtin_id, cmd_val)
  File "/home/andy/git/oilshell/oil/core/executor.py", line 121, in RunBuiltin
    builtin_func = self.builtins[builtin_id]
KeyError: 39
osh_.cc0 -A function prints functions

[osh_.cc stdout] Expected '__ec\n_ab\nadd\ndiv\nek\n--\n__ec\n_ab\n', got ''
[osh_.cc status] Expected 0, got -6

stdout:
stderr: 
osh_eval.opt: mycpp/mylib.h:674: V Dict<K, V>::index(K) [with K = int; V = vm::_Builtin*]: Assertion `0' failed.
osh_.py1 Invalid syntax

[osh_.py stdout] Expected 'status=2\n', got ''
[osh_.py status] Expected 0, got 1
[osh_.py stderr] Found 'Traceback (most recent'

stdout:
stderr: 
Traceback (most recent call last):
  File "/home/andy/git/oilshell/oil/bin/osh_eval.py", line 68, in <module>
    sys.exit(main(sys.argv))
  File "/home/andy/git/oilshell/oil/bin/osh_eval.py", line 36, in main
    None)
  File "/home/andy/git/oilshell/oil/core/shell_native.py", line 476, in Main
    cmd_flags=cmd_eval.IsMainProgram)
  File "/home/andy/git/oilshell/oil/core/main_loop.py", line 324, in Batch
    is_return, is_fatal = cmd_ev.ExecuteAndCatch(node, cmd_flags=cmd_flags)
  File "/home/andy/git/oilshell/oil/osh/cmd_eval.py", line 1498, in ExecuteAndCatch
    status = self._Execute(node)
  File "/home/andy/git/oilshell/oil/osh/cmd_eval.py", line 1345, in _Execute
    status, check_errexit = self._Dispatch(node, pipeline_st)
  File "/home/andy/git/oilshell/oil/osh/cmd_eval.py", line 623, in _Dispatch
    status = self._RunSimpleCommand(cmd_val, node.do_fork)
  File "/home/andy/git/oilshell/oil/osh/cmd_eval.py", line 477, in _RunSimpleCommand
    return self.shell_ex.RunSimpleCommand(cmd_val, do_fork)
  File "/home/andy/git/oilshell/oil/core/executor.py", line 230, in RunSimpleCommand
    return self.RunBuiltin(builtin_id, cmd_val)
  File "/home/andy/git/oilshell/oil/core/executor.py", line 121, in RunBuiltin
    builtin_func = self.builtins[builtin_id]
KeyError: 39
osh_.cc1 Invalid syntax

[osh_.cc stdout] Expected 'status=2\n', got ''
[osh_.cc status] Expected 0, got -6

stdout:
stderr: 
osh_eval.opt: mycpp/mylib.h:674: V Dict<K, V>::index(K) [with K = int; V = vm::_Builtin*]: Assertion `0' failed.
osh_.py2 how compgen calls completion functions

[osh_.py stdout] Expected "['argv', 'compgen', 'foo', '']\n['COMP_WORDS']\n['COMP_CWORD', '-1']\n['COMP_LINE', '']\n['COMP_POINT', '0']\none\ntwo\nthree\n", got ''
[osh_.py status] Expected 0, got 1
[osh_.py stderr] Found 'Traceback (most recent'

stdout:
stderr: 
Traceback (most recent call last):
  File "/home/andy/git/oilshell/oil/bin/osh_eval.py", line 68, in <module>
    sys.exit(main(sys.argv))
  File "/home/andy/git/oilshell/oil/bin/osh_eval.py", line 36, in main
    None)
  File "/home/andy/git/oilshell/oil/core/shell_native.py", line 476, in Main
    cmd_flags=cmd_eval.IsMainProgram)
  File "/home/andy/git/oilshell/oil/core/main_loop.py", line 324, in Batch
    is_return, is_fatal = cmd_ev.ExecuteAndCatch(node, cmd_flags=cmd_flags)
  File "/home/andy/git/oilshell/oil/osh/cmd_eval.py", line 1498, in ExecuteAndCatch
    status = self._Execute(node)
  File "/home/andy/git/oilshell/oil/osh/cmd_eval.py", line 1345, in _Execute
    status, check_errexit = self._Dispatch(node, pipeline_st)
  File "/home/andy/git/oilshell/oil/osh/cmd_eval.py", line 623, in _Dispatch
    status = self._RunSimpleCommand(cmd_val, node.do_fork)
  File "/home/andy/git/oilshell/oil/osh/cmd_eval.py", line 477, in _RunSimpleCommand
    return self.shell_ex.RunSimpleCommand(cmd_val, do_fork)
  File "/home/andy/git/oilshell/oil/core/executor.py", line 230, in RunSimpleCommand
    return self.RunBuiltin(builtin_id, cmd_val)
  File "/home/andy/git/oilshell/oil/core/executor.py", line 121, in RunBuiltin
    builtin_func = self.builtins[builtin_id]
KeyError: 39
osh_.cc2 how compgen calls completion functions

[osh_.cc stdout] Expected "['argv', 'compgen', 'foo', '']\n['COMP_WORDS']\n['COMP_CWORD', '-1']\n['COMP_LINE', '']\n['COMP_POINT', '0']\none\ntwo\nthree\n", got ''
[osh_.cc status] Expected 0, got -6

stdout:
stderr: 
osh_eval.opt: mycpp/mylib.h:674: V Dict<K, V>::index(K) [with K = int; V = vm::_Builtin*]: Assertion `0' failed.
osh_.py3 complete -o -F (git)

[osh_.py status] Expected 0, got 1
[osh_.py stderr] Found 'Traceback (most recent'

stdout:
stderr: 
Traceback (most recent call last):
  File "/home/andy/git/oilshell/oil/bin/osh_eval.py", line 68, in <module>
    sys.exit(main(sys.argv))
  File "/home/andy/git/oilshell/oil/bin/osh_eval.py", line 36, in main
    None)
  File "/home/andy/git/oilshell/oil/core/shell_native.py", line 476, in Main
    cmd_flags=cmd_eval.IsMainProgram)
  File "/home/andy/git/oilshell/oil/core/main_loop.py", line 324, in Batch
    is_return, is_fatal = cmd_ev.ExecuteAndCatch(node, cmd_flags=cmd_flags)
  File "/home/andy/git/oilshell/oil/osh/cmd_eval.py", line 1498, in ExecuteAndCatch
    status = self._Execute(node)
  File "/home/andy/git/oilshell/oil/osh/cmd_eval.py", line 1345, in _Execute
    status, check_errexit = self._Dispatch(node, pipeline_st)
  File "/home/andy/git/oilshell/oil/osh/cmd_eval.py", line 623, in _Dispatch
    status = self._RunSimpleCommand(cmd_val, node.do_fork)
  File "/home/andy/git/oilshell/oil/osh/cmd_eval.py", line 477, in _RunSimpleCommand
    return self.shell_ex.RunSimpleCommand(cmd_val, do_fork)
  File "/home/andy/git/oilshell/oil/core/executor.py", line 230, in RunSimpleCommand
    return self.RunBuiltin(builtin_id, cmd_val)
  File "/home/andy/git/oilshell/oil/core/executor.py", line 121, in RunBuiltin
    builtin_func = self.builtins[builtin_id]
KeyError: 38
osh_.cc3 complete -o -F (git)

[osh_.cc status] Expected 0, got -6

stdout:
stderr: 
osh_eval.opt: mycpp/mylib.h:674: V Dict<K, V>::index(K) [with K = int; V = vm::_Builtin*]: Assertion `0' failed.
osh_.py4 compopt with invalid syntax

[osh_.py stdout] Expected 'status=2\n', got ''
[osh_.py status] Expected 0, got 1
[osh_.py stderr] Found 'Traceback (most recent'

stdout:
stderr: 
Traceback (most recent call last):
  File "/home/andy/git/oilshell/oil/bin/osh_eval.py", line 68, in <module>
    sys.exit(main(sys.argv))
  File "/home/andy/git/oilshell/oil/bin/osh_eval.py", line 36, in main
    None)
  File "/home/andy/git/oilshell/oil/core/shell_native.py", line 476, in Main
    cmd_flags=cmd_eval.IsMainProgram)
  File "/home/andy/git/oilshell/oil/core/main_loop.py", line 324, in Batch
    is_return, is_fatal = cmd_ev.ExecuteAndCatch(node, cmd_flags=cmd_flags)
  File "/home/andy/git/oilshell/oil/osh/cmd_eval.py", line 1498, in ExecuteAndCatch
    status = self._Execute(node)
  File "/home/andy/git/oilshell/oil/osh/cmd_eval.py", line 1345, in _Execute
    status, check_errexit = self._Dispatch(node, pipeline_st)
  File "/home/andy/git/oilshell/oil/osh/cmd_eval.py", line 623, in _Dispatch
    status = self._RunSimpleCommand(cmd_val, node.do_fork)
  File "/home/andy/git/oilshell/oil/osh/cmd_eval.py", line 477, in _RunSimpleCommand
    return self.shell_ex.RunSimpleCommand(cmd_val, do_fork)
  File "/home/andy/git/oilshell/oil/core/executor.py", line 230, in RunSimpleCommand
    return self.RunBuiltin(builtin_id, cmd_val)
  File "/home/andy/git/oilshell/oil/core/executor.py", line 121, in RunBuiltin
    builtin_func = self.builtins[builtin_id]
KeyError: 40
osh_.cc4 compopt with invalid syntax

[osh_.cc stdout] Expected 'status=2\n', got ''
[osh_.cc status] Expected 0, got -6

stdout:
stderr: 
osh_eval.opt: mycpp/mylib.h:674: V Dict<K, V>::index(K) [with K = int; V = vm::_Builtin*]: Assertion `0' failed.
osh_.py5 compopt fails when not in completion function

[osh_.py stderr] Found 'Traceback (most recent'

stdout:
stderr: 
Traceback (most recent call last):
  File "/home/andy/git/oilshell/oil/bin/osh_eval.py", line 68, in <module>
    sys.exit(main(sys.argv))
  File "/home/andy/git/oilshell/oil/bin/osh_eval.py", line 36, in main
    None)
  File "/home/andy/git/oilshell/oil/core/shell_native.py", line 476, in Main
    cmd_flags=cmd_eval.IsMainProgram)
  File "/home/andy/git/oilshell/oil/core/main_loop.py", line 324, in Batch
    is_return, is_fatal = cmd_ev.ExecuteAndCatch(node, cmd_flags=cmd_flags)
  File "/home/andy/git/oilshell/oil/osh/cmd_eval.py", line 1498, in ExecuteAndCatch
    status = self._Execute(node)
  File "/home/andy/git/oilshell/oil/osh/cmd_eval.py", line 1345, in _Execute
    status, check_errexit = self._Dispatch(node, pipeline_st)
  File "/home/andy/git/oilshell/oil/osh/cmd_eval.py", line 623, in _Dispatch
    status = self._RunSimpleCommand(cmd_val, node.do_fork)
  File "/home/andy/git/oilshell/oil/osh/cmd_eval.py", line 477, in _RunSimpleCommand
    return self.shell_ex.RunSimpleCommand(cmd_val, do_fork)
  File "/home/andy/git/oilshell/oil/core/executor.py", line 230, in RunSimpleCommand
    return self.RunBuiltin(builtin_id, cmd_val)
  File "/home/andy/git/oilshell/oil/core/executor.py", line 121, in RunBuiltin
    builtin_func = self.builtins[builtin_id]
KeyError: 40
osh_.cc5 compopt fails when not in completion function

[osh_.cc status] Expected 1, got -6

stdout:
stderr: 
osh_eval.opt: mycpp/mylib.h:674: V Dict<K, V>::index(K) [with K = int; V = vm::_Builtin*]: Assertion `0' failed.
osh_.py6 compgen -f on invalid dir

[osh_.py stderr] Found 'Traceback (most recent'

stdout:
stderr: 
Traceback (most recent call last):
  File "/home/andy/git/oilshell/oil/bin/osh_eval.py", line 68, in <module>
    sys.exit(main(sys.argv))
  File "/home/andy/git/oilshell/oil/bin/osh_eval.py", line 36, in main
    None)
  File "/home/andy/git/oilshell/oil/core/shell_native.py", line 476, in Main
    cmd_flags=cmd_eval.IsMainProgram)
  File "/home/andy/git/oilshell/oil/core/main_loop.py", line 324, in Batch
    is_return, is_fatal = cmd_ev.ExecuteAndCatch(node, cmd_flags=cmd_flags)
  File "/home/andy/git/oilshell/oil/osh/cmd_eval.py", line 1498, in ExecuteAndCatch
    status = self._Execute(node)
  File "/home/andy/git/oilshell/oil/osh/cmd_eval.py", line 1345, in _Execute
    status, check_errexit = self._Dispatch(node, pipeline_st)
  File "/home/andy/git/oilshell/oil/osh/cmd_eval.py", line 623, in _Dispatch
    status = self._RunSimpleCommand(cmd_val, node.do_fork)
  File "/home/andy/git/oilshell/oil/osh/cmd_eval.py", line 477, in _RunSimpleCommand
    return self.shell_ex.RunSimpleCommand(cmd_val, do_fork)
  File "/home/andy/git/oilshell/oil/core/executor.py", line 230, in RunSimpleCommand
    return self.RunBuiltin(builtin_id, cmd_val)
  File "/home/andy/git/oilshell/oil/core/executor.py", line 121, in RunBuiltin
    builtin_func = self.builtins[builtin_id]
KeyError: 39
osh_.cc6 compgen -f on invalid dir

[osh_.cc status] Expected 1, got -6

stdout:
stderr: 
osh_eval.opt: mycpp/mylib.h:674: V Dict<K, V>::index(K) [with K = int; V = vm::_Builtin*]: Assertion `0' failed.
osh_.py7 compgen -f

[osh_.py stdout] Expected 'one\nthree\ntwo\n--\nthree\ntwo\n', got '--\n'
[osh_.py stderr] Found 'Traceback (most recent'

stdout:
--
stderr:
Traceback (most recent call last):
  File "/home/andy/git/oilshell/oil/bin/osh_eval.py", line 68, in <module>
    sys.exit(main(sys.argv))
  File "/home/andy/git/oilshell/oil/bin/osh_eval.py", line 36, in main
    None)
  File "/home/andy/git/oilshell/oil/core/shell_native.py", line 476, in Main
    cmd_flags=cmd_eval.IsMainProgram)
  File "/home/andy/git/oilshell/oil/core/main_loop.py", line 324, in Batch
    is_return, is_fatal = cmd_ev.ExecuteAndCatch(node, cmd_flags=cmd_flags)
  File "/home/andy/git/oilshell/oil/osh/cmd_eval.py", line 1498, in ExecuteAndCatch
    status = self._Execute(node)
  File "/home/andy/git/oilshell/oil/osh/cmd_eval.py", line 1345, in _Execute
    status, check_errexit = self._Dispatch(node, pipeline_st)
  File "/home/andy/git/oilshell/oil/osh/cmd_eval.py", line 667, in _Dispatch
    self.shell_ex.RunPipeline(node, pipeline_st)
  File "/home/andy/git/oilshell/oil/core/executor.py", line 325, in RunPipeline
    status_out.codes = pi.Run(self.waiter, self.fd_state)
  File "/home/andy/git/oilshell/oil/core/process.py", line 1080, in Run
    self.Start(waiter)
  File "/home/andy/git/oilshell/oil/core/process.py", line 1017, in Start
    pid = proc.Start(trace.PipelinePart())
  File "/home/andy/git/oilshell/oil/core/process.py", line 880, in Start
    self.thunk.Run()
  File "/home/andy/git/oilshell/oil/core/process.py", line 704, in Run
    self.cmd_ev.ExecuteAndCatch(self.node, cmd_flags=cmd_eval.Optimize)
  File "/home/andy/git/oilshell/oil/osh/cmd_eval.py", line 1498, in ExecuteAndCatch
    status = self._Execute(node)
  File "/home/andy/git/oilshell/oil/osh/cmd_eval.py", line 1345, in _Execute
    status, check_errexit = self._Dispatch(node, pipeline_st)
  File "/home/andy/git/oilshell/oil/osh/cmd_eval.py", line 623, in _Dispatch
    status = self._RunSimpleCommand(cmd_val, node.do_fork)
  File "/home/andy/git/oilshell/oil/osh/cmd_eval.py", line 477, in _RunSimpleCommand
    return self.shell_ex.RunSimpleCommand(cmd_val, do_fork)
  File "/home/andy/git/oilshell/oil/core/executor.py", line 230, in RunSimpleCommand
    return self.RunBuiltin(builtin_id, cmd_val)
  File "/home/andy/git/oilshell/oil/core/executor.py", line 121, in RunBuiltin
    builtin_func = self.builtins[builtin_id]
KeyError: 39
Traceback (most recent call last):
  File "/home/andy/git/oilshell/oil/bin/osh_eval.py", line 68, in <module>
    sys.exit(main(sys.argv))
  File "/home/andy/git/oilshell/oil/bin/osh_eval.py", line 36, in main
    None)
  File "/home/andy/git/oilshell/oil/core/shell_native.py", line 476, in Main
    cmd_flags=cmd_eval.IsMainProgram)
  File "/home/andy/git/oilshell/oil/core/main_loop.py", line 324, in Batch
    is_return, is_fatal = cmd_ev.ExecuteAndCatch(node, cmd_flags=cmd_flags)
  File "/home/andy/git/oilshell/oil/osh/cmd_eval.py", line 1498, in ExecuteAndCatch
    status = self._Execute(node)
  File "/home/andy/git/oilshell/oil/osh/cmd_eval.py", line 1345, in _Execute
    status, check_errexit = self._Dispatch(node, pipeline_st)
  File "/home/andy/git/oilshell/oil/osh/cmd_eval.py", line 667, in _Dispatch
    self.shell_ex.RunPipeline(node, pipeline_st)
  File "/home/andy/git/oilshell/oil/core/executor.py", line 325, in RunPipeline
    status_out.codes = pi.Run(self.waiter, self.fd_state)
  File "/home/andy/git/oilshell/oil/core/process.py", line 1080, in Run
    self.Start(waiter)
  File "/home/andy/git/oilshell/oil/core/process.py", line 1017, in Start
    pid = proc.Start(trace.PipelinePart())
  File "/home/andy/git/oilshell/oil/core/process.py", line 880, in Start
    self.thunk.Run()
  File "/home/andy/git/oilshell/oil/core/process.py", line 704, in Run
    self.cmd_ev.ExecuteAndCatch(self.node, cmd_flags=cmd_eval.Optimize)
  File "/home/andy/git/oilshell/oil/osh/cmd_eval.py", line 1498, in ExecuteAndCatch
    status = self._Execute(node)
  File "/home/andy/git/oilshell/oil/osh/cmd_eval.py", line 1345, in _Execute
    status, check_errexit = self._Dispatch(node, pipeline_st)
  File "/home/andy/git/oilshell/oil/osh/cmd_eval.py", line 623, in _Dispatch
    status = self._RunSimpleCommand(cmd_val, node.do_fork)
  File "/home/andy/git/oilshell/oil/osh/cmd_eval.py", line 477, in _RunSimpleCommand
    return self.shell_ex.RunSimpleCommand(cmd_val, do_fork)
  File "/home/andy/git/oilshell/oil/core/executor.py", line 230, in RunSimpleCommand
    return self.RunBuiltin(builtin_id, cmd_val)
  File "/home/andy/git/oilshell/oil/core/executor.py", line 121, in RunBuiltin
    builtin_func = self.builtins[builtin_id]
KeyError: 39
osh_.cc7 compgen -f

[osh_.cc stdout] Expected 'one\nthree\ntwo\n--\nthree\ntwo\n', got ''
[osh_.cc status] Expected 0, got -6

stdout:
stderr: 
osh_eval.opt: cpp/posix.h:106: Tuple2<int, int> posix::pipe(): Assertion `0' failed.
osh_.py8 compgen -v with local vars

[osh_.py stdout] Expected 'v1_global\nv2_local\n', got ''
[osh_.py status] Expected 0, got 1
[osh_.py stderr] Found 'Traceback (most recent'

stdout:
stderr: 
Traceback (most recent call last):
  File "/home/andy/git/oilshell/oil/bin/osh_eval.py", line 68, in <module>
    sys.exit(main(sys.argv))
  File "/home/andy/git/oilshell/oil/bin/osh_eval.py", line 36, in main
    None)
  File "/home/andy/git/oilshell/oil/core/shell_native.py", line 476, in Main
    cmd_flags=cmd_eval.IsMainProgram)
  File "/home/andy/git/oilshell/oil/core/main_loop.py", line 324, in Batch
    is_return, is_fatal = cmd_ev.ExecuteAndCatch(node, cmd_flags=cmd_flags)
  File "/home/andy/git/oilshell/oil/osh/cmd_eval.py", line 1498, in ExecuteAndCatch
    status = self._Execute(node)
  File "/home/andy/git/oilshell/oil/osh/cmd_eval.py", line 1345, in _Execute
    status, check_errexit = self._Dispatch(node, pipeline_st)
  File "/home/andy/git/oilshell/oil/osh/cmd_eval.py", line 623, in _Dispatch
    status = self._RunSimpleCommand(cmd_val, node.do_fork)
  File "/home/andy/git/oilshell/oil/osh/cmd_eval.py", line 477, in _RunSimpleCommand
    return self.shell_ex.RunSimpleCommand(cmd_val, do_fork)
  File "/home/andy/git/oilshell/oil/core/executor.py", line 224, in RunSimpleCommand
    status = self.cmd_ev.RunProc(proc_node, argv[1:])
  File "/home/andy/git/oilshell/oil/osh/cmd_eval.py", line 1642, in RunProc
    status = self._Execute(proc.body)
  File "/home/andy/git/oilshell/oil/osh/cmd_eval.py", line 1345, in _Execute
    status, check_errexit = self._Dispatch(node, pipeline_st)
  File "/home/andy/git/oilshell/oil/osh/cmd_eval.py", line 998, in _Dispatch
    status = self._ExecuteList(node.children)
  File "/home/andy/git/oilshell/oil/osh/cmd_eval.py", line 1401, in _ExecuteList
    status = self._Execute(child)
  File "/home/andy/git/oilshell/oil/osh/cmd_eval.py", line 1345, in _Execute
    status, check_errexit = self._Dispatch(node, pipeline_st)
  File "/home/andy/git/oilshell/oil/osh/cmd_eval.py", line 623, in _Dispatch
    status = self._RunSimpleCommand(cmd_val, node.do_fork)
  File "/home/andy/git/oilshell/oil/osh/cmd_eval.py", line 477, in _RunSimpleCommand
    return self.shell_ex.RunSimpleCommand(cmd_val, do_fork)
  File "/home/andy/git/oilshell/oil/core/executor.py", line 230, in RunSimpleCommand
    return self.RunBuiltin(builtin_id, cmd_val)
  File "/home/andy/git/oilshell/oil/core/executor.py", line 121, in RunBuiltin
    builtin_func = self.builtins[builtin_id]
KeyError: 39
osh_.cc8 compgen -v with local vars

[osh_.cc stdout] Expected 'v1_global\nv2_local\n', got ''
[osh_.cc status] Expected 0, got -6

stdout:
stderr: 
osh_eval.opt: mycpp/mylib.h:674: V Dict<K, V>::index(K) [with K = int; V = vm::_Builtin*]: Assertion `0' failed.
osh_.py9 compgen -v on unknown var

[osh_.py stderr] Found 'Traceback (most recent'

stdout:
stderr: 
Traceback (most recent call last):
  File "/home/andy/git/oilshell/oil/bin/osh_eval.py", line 68, in <module>
    sys.exit(main(sys.argv))
  File "/home/andy/git/oilshell/oil/bin/osh_eval.py", line 36, in main
    None)
  File "/home/andy/git/oilshell/oil/core/shell_native.py", line 476, in Main
    cmd_flags=cmd_eval.IsMainProgram)
  File "/home/andy/git/oilshell/oil/core/main_loop.py", line 324, in Batch
    is_return, is_fatal = cmd_ev.ExecuteAndCatch(node, cmd_flags=cmd_flags)
  File "/home/andy/git/oilshell/oil/osh/cmd_eval.py", line 1498, in ExecuteAndCatch
    status = self._Execute(node)
  File "/home/andy/git/oilshell/oil/osh/cmd_eval.py", line 1345, in _Execute
    status, check_errexit = self._Dispatch(node, pipeline_st)
  File "/home/andy/git/oilshell/oil/osh/cmd_eval.py", line 623, in _Dispatch
    status = self._RunSimpleCommand(cmd_val, node.do_fork)
  File "/home/andy/git/oilshell/oil/osh/cmd_eval.py", line 477, in _RunSimpleCommand
    return self.shell_ex.RunSimpleCommand(cmd_val, do_fork)
  File "/home/andy/git/oilshell/oil/core/executor.py", line 230, in RunSimpleCommand
    return self.RunBuiltin(builtin_id, cmd_val)
  File "/home/andy/git/oilshell/oil/core/executor.py", line 121, in RunBuiltin
    builtin_func = self.builtins[builtin_id]
KeyError: 39
osh_.cc9 compgen -v on unknown var

[osh_.cc status] Expected 1, got -6

stdout:
stderr: 
osh_eval.opt: mycpp/mylib.h:674: V Dict<K, V>::index(K) [with K = int; V = vm::_Builtin*]: Assertion `0' failed.
osh_.py10 compgen -v P

[osh_.py stdout] Expected 'PATH\nPWD\n', got ''
[osh_.py stderr] Found 'Traceback (most recent'

stdout:
stderr: 
  cd > /dev/null  # for some reason in bash, this makes PIPESTATUS appear!
  ^~
[ stdin ]:1: $HOME isn't defined
Traceback (most recent call last):
  File "/home/andy/git/oilshell/oil/bin/osh_eval.py", line 68, in <module>
    sys.exit(main(sys.argv))
  File "/home/andy/git/oilshell/oil/bin/osh_eval.py", line 36, in main
    None)
  File "/home/andy/git/oilshell/oil/core/shell_native.py", line 476, in Main
    cmd_flags=cmd_eval.IsMainProgram)
  File "/home/andy/git/oilshell/oil/core/main_loop.py", line 324, in Batch
    is_return, is_fatal = cmd_ev.ExecuteAndCatch(node, cmd_flags=cmd_flags)
  File "/home/andy/git/oilshell/oil/osh/cmd_eval.py", line 1498, in ExecuteAndCatch
    status = self._Execute(node)
  File "/home/andy/git/oilshell/oil/osh/cmd_eval.py", line 1345, in _Execute
    status, check_errexit = self._Dispatch(node, pipeline_st)
  File "/home/andy/git/oilshell/oil/osh/cmd_eval.py", line 667, in _Dispatch
    self.shell_ex.RunPipeline(node, pipeline_st)
  File "/home/andy/git/oilshell/oil/core/executor.py", line 325, in RunPipeline
    status_out.codes = pi.Run(self.waiter, self.fd_state)
  File "/home/andy/git/oilshell/oil/core/process.py", line 1080, in Run
    self.Start(waiter)
  File "/home/andy/git/oilshell/oil/core/process.py", line 1017, in Start
    pid = proc.Start(trace.PipelinePart())
  File "/home/andy/git/oilshell/oil/core/process.py", line 880, in Start
    self.thunk.Run()
  File "/home/andy/git/oilshell/oil/core/process.py", line 704, in Run
    self.cmd_ev.ExecuteAndCatch(self.node, cmd_flags=cmd_eval.Optimize)
  File "/home/andy/git/oilshell/oil/osh/cmd_eval.py", line 1498, in ExecuteAndCatch
    status = self._Execute(node)
  File "/home/andy/git/oilshell/oil/osh/cmd_eval.py", line 1345, in _Execute
    status, check_errexit = self._Dispatch(node, pipeline_st)
  File "/home/andy/git/oilshell/oil/osh/cmd_eval.py", line 623, in _Dispatch
    status = self._RunSimpleCommand(cmd_val, node.do_fork)
  File "/home/andy/git/oilshell/oil/osh/cmd_eval.py", line 477, in _RunSimpleCommand
    return self.shell_ex.RunSimpleCommand(cmd_val, do_fork)
  File "/home/andy/git/oilshell/oil/core/executor.py", line 230, in RunSimpleCommand
    return self.RunBuiltin(builtin_id, cmd_val)
  File "/home/andy/git/oilshell/oil/core/executor.py", line 121, in RunBuiltin
    builtin_func = self.builtins[builtin_id]
KeyError: 39
osh_.cc10 compgen -v P

[osh_.cc stdout] Expected 'PATH\nPWD\n', got ''
[osh_.cc status] Expected 0, got -6

stdout:
stderr: 
osh_eval.opt: cpp/posix.h:143: void posix::dup2(int, int): Assertion `0' failed.
osh_.py11 compgen with actions: function / variable / file

[osh_.py stdout] Expected 'PA_FUNC\nPATH\nPA_FILE\n', got ''
[osh_.py status] Expected 0, got 1
[osh_.py stderr] Found 'Traceback (most recent'

stdout:
stderr: 
Traceback (most recent call last):
  File "/home/andy/git/oilshell/oil/bin/osh_eval.py", line 68, in <module>
    sys.exit(main(sys.argv))
  File "/home/andy/git/oilshell/oil/bin/osh_eval.py", line 36, in main
    None)
  File "/home/andy/git/oilshell/oil/core/shell_native.py", line 476, in Main
    cmd_flags=cmd_eval.IsMainProgram)
  File "/home/andy/git/oilshell/oil/core/main_loop.py", line 324, in Batch
    is_return, is_fatal = cmd_ev.ExecuteAndCatch(node, cmd_flags=cmd_flags)
  File "/home/andy/git/oilshell/oil/osh/cmd_eval.py", line 1498, in ExecuteAndCatch
    status = self._Execute(node)
  File "/home/andy/git/oilshell/oil/osh/cmd_eval.py", line 1345, in _Execute
    status, check_errexit = self._Dispatch(node, pipeline_st)
  File "/home/andy/git/oilshell/oil/osh/cmd_eval.py", line 623, in _Dispatch
    status = self._RunSimpleCommand(cmd_val, node.do_fork)
  File "/home/andy/git/oilshell/oil/osh/cmd_eval.py", line 477, in _RunSimpleCommand
    return self.shell_ex.RunSimpleCommand(cmd_val, do_fork)
  File "/home/andy/git/oilshell/oil/core/executor.py", line 230, in RunSimpleCommand
    return self.RunBuiltin(builtin_id, cmd_val)
  File "/home/andy/git/oilshell/oil/core/executor.py", line 121, in RunBuiltin
    builtin_func = self.builtins[builtin_id]
KeyError: 39
osh_.cc11 compgen with actions: function / variable / file

[osh_.cc stdout] Expected 'PA_FUNC\nPATH\nPA_FILE\n', got ''
[osh_.cc status] Expected 0, got -6

stdout:
stderr: 
osh_eval.opt: mycpp/mylib.h:674: V Dict<K, V>::index(K) [with K = int; V = vm::_Builtin*]: Assertion `0' failed.
osh_.py12 compgen with actions: alias, setopt

[osh_.py stdout] Expected 'v_alias\nv_alias2\nverbose\nvi\n', got ''
[osh_.py status] Expected 0, got 1
[osh_.py stderr] Found 'Traceback (most recent'

stdout:
stderr: 
Traceback (most recent call last):
  File "/home/andy/git/oilshell/oil/bin/osh_eval.py", line 68, in <module>
    sys.exit(main(sys.argv))
  File "/home/andy/git/oilshell/oil/bin/osh_eval.py", line 36, in main
    None)
  File "/home/andy/git/oilshell/oil/core/shell_native.py", line 476, in Main
    cmd_flags=cmd_eval.IsMainProgram)
  File "/home/andy/git/oilshell/oil/core/main_loop.py", line 324, in Batch
    is_return, is_fatal = cmd_ev.ExecuteAndCatch(node, cmd_flags=cmd_flags)
  File "/home/andy/git/oilshell/oil/osh/cmd_eval.py", line 1498, in ExecuteAndCatch
    status = self._Execute(node)
  File "/home/andy/git/oilshell/oil/osh/cmd_eval.py", line 1345, in _Execute
    status, check_errexit = self._Dispatch(node, pipeline_st)
  File "/home/andy/git/oilshell/oil/osh/cmd_eval.py", line 623, in _Dispatch
    status = self._RunSimpleCommand(cmd_val, node.do_fork)
  File "/home/andy/git/oilshell/oil/osh/cmd_eval.py", line 477, in _RunSimpleCommand
    return self.shell_ex.RunSimpleCommand(cmd_val, do_fork)
  File "/home/andy/git/oilshell/oil/core/executor.py", line 230, in RunSimpleCommand
    return self.RunBuiltin(builtin_id, cmd_val)
  File "/home/andy/git/oilshell/oil/core/executor.py", line 121, in RunBuiltin
    builtin_func = self.builtins[builtin_id]
KeyError: 39
osh_.cc12 compgen with actions: alias, setopt

[osh_.cc stdout] Expected 'v_alias\nv_alias2\nverbose\nvi\n', got ''
[osh_.cc status] Expected 0, got -6

stdout:
stderr: 
osh_eval.opt: mycpp/mylib.h:674: V Dict<K, V>::index(K) [with K = int; V = vm::_Builtin*]: Assertion `0' failed.
osh_.py13 compgen with actions: shopt

[osh_.py stdout] Expected '[nullglob]\n', got ''
[osh_.py status] Expected 0, got 1
[osh_.py stderr] Found 'Traceback (most recent'

stdout:
stderr: 
Traceback (most recent call last):
  File "/home/andy/git/oilshell/oil/bin/osh_eval.py", line 68, in <module>
    sys.exit(main(sys.argv))
  File "/home/andy/git/oilshell/oil/bin/osh_eval.py", line 36, in main
    None)
  File "/home/andy/git/oilshell/oil/core/shell_native.py", line 476, in Main
    cmd_flags=cmd_eval.IsMainProgram)
  File "/home/andy/git/oilshell/oil/core/main_loop.py", line 324, in Batch
    is_return, is_fatal = cmd_ev.ExecuteAndCatch(node, cmd_flags=cmd_flags)
  File "/home/andy/git/oilshell/oil/osh/cmd_eval.py", line 1498, in ExecuteAndCatch
    status = self._Execute(node)
  File "/home/andy/git/oilshell/oil/osh/cmd_eval.py", line 1345, in _Execute
    status, check_errexit = self._Dispatch(node, pipeline_st)
  File "/home/andy/git/oilshell/oil/osh/cmd_eval.py", line 623, in _Dispatch
    status = self._RunSimpleCommand(cmd_val, node.do_fork)
  File "/home/andy/git/oilshell/oil/osh/cmd_eval.py", line 477, in _RunSimpleCommand
    return self.shell_ex.RunSimpleCommand(cmd_val, do_fork)
  File "/home/andy/git/oilshell/oil/core/executor.py", line 230, in RunSimpleCommand
    return self.RunBuiltin(builtin_id, cmd_val)
  File "/home/andy/git/oilshell/oil/core/executor.py", line 121, in RunBuiltin
    builtin_func = self.builtins[builtin_id]
KeyError: 39
osh_.cc13 compgen with actions: shopt

[osh_.cc stdout] Expected '[nullglob]\n', got ''
[osh_.cc status] Expected 0, got -6

stdout:
stderr: 
osh_eval.opt: mycpp/mylib.h:674: V Dict<K, V>::index(K) [with K = int; V = vm::_Builtin*]: Assertion `0' failed.
osh_.py14 compgen with action and suffix: helptopic

[osh_.py stdout] Expected 'false___\n', got ''
[osh_.py status] Expected 0, got 1
[osh_.py stderr] Found 'Traceback (most recent'

stdout:
stderr: 
Traceback (most recent call last):
  File "/home/andy/git/oilshell/oil/bin/osh_eval.py", line 68, in <module>
    sys.exit(main(sys.argv))
  File "/home/andy/git/oilshell/oil/bin/osh_eval.py", line 36, in main
    None)
  File "/home/andy/git/oilshell/oil/core/shell_native.py", line 476, in Main
    cmd_flags=cmd_eval.IsMainProgram)
  File "/home/andy/git/oilshell/oil/core/main_loop.py", line 324, in Batch
    is_return, is_fatal = cmd_ev.ExecuteAndCatch(node, cmd_flags=cmd_flags)
  File "/home/andy/git/oilshell/oil/osh/cmd_eval.py", line 1498, in ExecuteAndCatch
    status = self._Execute(node)
  File "/home/andy/git/oilshell/oil/osh/cmd_eval.py", line 1345, in _Execute
    status, check_errexit = self._Dispatch(node, pipeline_st)
  File "/home/andy/git/oilshell/oil/osh/cmd_eval.py", line 623, in _Dispatch
    status = self._RunSimpleCommand(cmd_val, node.do_fork)
  File "/home/andy/git/oilshell/oil/osh/cmd_eval.py", line 477, in _RunSimpleCommand
    return self.shell_ex.RunSimpleCommand(cmd_val, do_fork)
  File "/home/andy/git/oilshell/oil/core/executor.py", line 230, in RunSimpleCommand
    return self.RunBuiltin(builtin_id, cmd_val)
  File "/home/andy/git/oilshell/oil/core/executor.py", line 121, in RunBuiltin
    builtin_func = self.builtins[builtin_id]
KeyError: 39
osh_.cc14 compgen with action and suffix: helptopic

[osh_.cc stdout] Expected 'false___\n', got ''
[osh_.cc status] Expected 0, got -6

stdout:
stderr: 
osh_eval.opt: mycpp/mylib.h:674: V Dict<K, V>::index(K) [with K = int; V = vm::_Builtin*]: Assertion `0' failed.
osh_.py15 compgen -A directory

[osh_.py stdout] Expected 'pgen2\npylib\npy-yajl\n', got ''
[osh_.py stderr] Found 'Traceback (most recent'

stdout:
stderr: 
Traceback (most recent call last):
  File "/home/andy/git/oilshell/oil/bin/osh_eval.py", line 68, in <module>
    sys.exit(main(sys.argv))
  File "/home/andy/git/oilshell/oil/bin/osh_eval.py", line 36, in main
    None)
  File "/home/andy/git/oilshell/oil/core/shell_native.py", line 476, in Main
    cmd_flags=cmd_eval.IsMainProgram)
  File "/home/andy/git/oilshell/oil/core/main_loop.py", line 324, in Batch
    is_return, is_fatal = cmd_ev.ExecuteAndCatch(node, cmd_flags=cmd_flags)
  File "/home/andy/git/oilshell/oil/osh/cmd_eval.py", line 1498, in ExecuteAndCatch
    status = self._Execute(node)
  File "/home/andy/git/oilshell/oil/osh/cmd_eval.py", line 1345, in _Execute
    status, check_errexit = self._Dispatch(node, pipeline_st)
  File "/home/andy/git/oilshell/oil/osh/cmd_eval.py", line 667, in _Dispatch
    self.shell_ex.RunPipeline(node, pipeline_st)
  File "/home/andy/git/oilshell/oil/core/executor.py", line 325, in RunPipeline
    status_out.codes = pi.Run(self.waiter, self.fd_state)
  File "/home/andy/git/oilshell/oil/core/process.py", line 1080, in Run
    self.Start(waiter)
  File "/home/andy/git/oilshell/oil/core/process.py", line 1017, in Start
    pid = proc.Start(trace.PipelinePart())
  File "/home/andy/git/oilshell/oil/core/process.py", line 880, in Start
    self.thunk.Run()
  File "/home/andy/git/oilshell/oil/core/process.py", line 704, in Run
    self.cmd_ev.ExecuteAndCatch(self.node, cmd_flags=cmd_eval.Optimize)
  File "/home/andy/git/oilshell/oil/osh/cmd_eval.py", line 1498, in ExecuteAndCatch
    status = self._Execute(node)
  File "/home/andy/git/oilshell/oil/osh/cmd_eval.py", line 1345, in _Execute
    status, check_errexit = self._Dispatch(node, pipeline_st)
  File "/home/andy/git/oilshell/oil/osh/cmd_eval.py", line 623, in _Dispatch
    status = self._RunSimpleCommand(cmd_val, node.do_fork)
  File "/home/andy/git/oilshell/oil/osh/cmd_eval.py", line 477, in _RunSimpleCommand
    return self.shell_ex.RunSimpleCommand(cmd_val, do_fork)
  File "/home/andy/git/oilshell/oil/core/executor.py", line 230, in RunSimpleCommand
    return self.RunBuiltin(builtin_id, cmd_val)
  File "/home/andy/git/oilshell/oil/core/executor.py", line 121, in RunBuiltin
    builtin_func = self.builtins[builtin_id]
KeyError: 39
osh_.cc15 compgen -A directory

[osh_.cc stdout] Expected 'pgen2\npylib\npy-yajl\n', got ''
[osh_.cc status] Expected 0, got -6

stdout:
stderr: 
osh_eval.opt: cpp/posix.h:106: Tuple2<int, int> posix::pipe(): Assertion `0' failed.
osh_.py16 compgen -A file

[osh_.py stdout] Expected 'benchmarks\nbin\nbuild\n', got ''
[osh_.py stderr] Found 'Traceback (most recent'

stdout:
stderr: 
Traceback (most recent call last):
  File "/home/andy/git/oilshell/oil/bin/osh_eval.py", line 68, in <module>
    sys.exit(main(sys.argv))
  File "/home/andy/git/oilshell/oil/bin/osh_eval.py", line 36, in main
    None)
  File "/home/andy/git/oilshell/oil/core/shell_native.py", line 476, in Main
    cmd_flags=cmd_eval.IsMainProgram)
  File "/home/andy/git/oilshell/oil/core/main_loop.py", line 324, in Batch
    is_return, is_fatal = cmd_ev.ExecuteAndCatch(node, cmd_flags=cmd_flags)
  File "/home/andy/git/oilshell/oil/osh/cmd_eval.py", line 1498, in ExecuteAndCatch
    status = self._Execute(node)
  File "/home/andy/git/oilshell/oil/osh/cmd_eval.py", line 1345, in _Execute
    status, check_errexit = self._Dispatch(node, pipeline_st)
  File "/home/andy/git/oilshell/oil/osh/cmd_eval.py", line 667, in _Dispatch
    self.shell_ex.RunPipeline(node, pipeline_st)
  File "/home/andy/git/oilshell/oil/core/executor.py", line 325, in RunPipeline
    status_out.codes = pi.Run(self.waiter, self.fd_state)
  File "/home/andy/git/oilshell/oil/core/process.py", line 1080, in Run
    self.Start(waiter)
  File "/home/andy/git/oilshell/oil/core/process.py", line 1017, in Start
    pid = proc.Start(trace.PipelinePart())
  File "/home/andy/git/oilshell/oil/core/process.py", line 880, in Start
    self.thunk.Run()
  File "/home/andy/git/oilshell/oil/core/process.py", line 704, in Run
    self.cmd_ev.ExecuteAndCatch(self.node, cmd_flags=cmd_eval.Optimize)
  File "/home/andy/git/oilshell/oil/osh/cmd_eval.py", line 1498, in ExecuteAndCatch
    status = self._Execute(node)
  File "/home/andy/git/oilshell/oil/osh/cmd_eval.py", line 1345, in _Execute
    status, check_errexit = self._Dispatch(node, pipeline_st)
  File "/home/andy/git/oilshell/oil/osh/cmd_eval.py", line 623, in _Dispatch
    status = self._RunSimpleCommand(cmd_val, node.do_fork)
  File "/home/andy/git/oilshell/oil/osh/cmd_eval.py", line 477, in _RunSimpleCommand
    return self.shell_ex.RunSimpleCommand(cmd_val, do_fork)
  File "/home/andy/git/oilshell/oil/core/executor.py", line 230, in RunSimpleCommand
    return self.RunBuiltin(builtin_id, cmd_val)
  File "/home/andy/git/oilshell/oil/core/executor.py", line 121, in RunBuiltin
    builtin_func = self.builtins[builtin_id]
KeyError: 39
osh_.cc16 compgen -A file

[osh_.cc stdout] Expected 'benchmarks\nbin\nbuild\n', got ''
[osh_.cc status] Expected 0, got -6

stdout:
stderr: 
osh_eval.opt: cpp/posix.h:106: Tuple2<int, int> posix::pipe(): Assertion `0' failed.
osh_.py17 compgen -A user

[osh_.py status] Expected 0, got 1
[osh_.py stderr] Found 'Traceback (most recent'

stdout:
stderr: 
Traceback (most recent call last):
  File "/home/andy/git/oilshell/oil/bin/osh_eval.py", line 68, in <module>
    sys.exit(main(sys.argv))
  File "/home/andy/git/oilshell/oil/bin/osh_eval.py", line 36, in main
    None)
  File "/home/andy/git/oilshell/oil/core/shell_native.py", line 476, in Main
    cmd_flags=cmd_eval.IsMainProgram)
  File "/home/andy/git/oilshell/oil/core/main_loop.py", line 324, in Batch
    is_return, is_fatal = cmd_ev.ExecuteAndCatch(node, cmd_flags=cmd_flags)
  File "/home/andy/git/oilshell/oil/osh/cmd_eval.py", line 1498, in ExecuteAndCatch
    status = self._Execute(node)
  File "/home/andy/git/oilshell/oil/osh/cmd_eval.py", line 1345, in _Execute
    status, check_errexit = self._Dispatch(node, pipeline_st)
  File "/home/andy/git/oilshell/oil/osh/cmd_eval.py", line 623, in _Dispatch
    status = self._RunSimpleCommand(cmd_val, node.do_fork)
  File "/home/andy/git/oilshell/oil/osh/cmd_eval.py", line 477, in _RunSimpleCommand
    return self.shell_ex.RunSimpleCommand(cmd_val, do_fork)
  File "/home/andy/git/oilshell/oil/core/executor.py", line 230, in RunSimpleCommand
    return self.RunBuiltin(builtin_id, cmd_val)
  File "/home/andy/git/oilshell/oil/core/executor.py", line 121, in RunBuiltin
    builtin_func = self.builtins[builtin_id]
KeyError: 39
osh_.cc17 compgen -A user

[osh_.cc status] Expected 0, got -6

stdout:
stderr: 
osh_eval.opt: mycpp/mylib.h:674: V Dict<K, V>::index(K) [with K = int; V = vm::_Builtin*]: Assertion `0' failed.
osh_.py18 compgen -A command completes external commands

[osh_.py stdout] Expected 'xargs\nstatus=0\n', got 'status=0\n'
[osh_.py stderr] Found 'Traceback (most recent'

stdout:
status=0
stderr:
Traceback (most recent call last):
  File "/home/andy/git/oilshell/oil/bin/osh_eval.py", line 68, in <module>
    sys.exit(main(sys.argv))
  File "/home/andy/git/oilshell/oil/bin/osh_eval.py", line 36, in main
    None)
  File "/home/andy/git/oilshell/oil/core/shell_native.py", line 476, in Main
    cmd_flags=cmd_eval.IsMainProgram)
  File "/home/andy/git/oilshell/oil/core/main_loop.py", line 324, in Batch
    is_return, is_fatal = cmd_ev.ExecuteAndCatch(node, cmd_flags=cmd_flags)
  File "/home/andy/git/oilshell/oil/osh/cmd_eval.py", line 1498, in ExecuteAndCatch
    status = self._Execute(node)
  File "/home/andy/git/oilshell/oil/osh/cmd_eval.py", line 1345, in _Execute
    status, check_errexit = self._Dispatch(node, pipeline_st)
  File "/home/andy/git/oilshell/oil/osh/cmd_eval.py", line 667, in _Dispatch
    self.shell_ex.RunPipeline(node, pipeline_st)
  File "/home/andy/git/oilshell/oil/core/executor.py", line 325, in RunPipeline
    status_out.codes = pi.Run(self.waiter, self.fd_state)
  File "/home/andy/git/oilshell/oil/core/process.py", line 1080, in Run
    self.Start(waiter)
  File "/home/andy/git/oilshell/oil/core/process.py", line 1017, in Start
    pid = proc.Start(trace.PipelinePart())
  File "/home/andy/git/oilshell/oil/core/process.py", line 880, in Start
    self.thunk.Run()
  File "/home/andy/git/oilshell/oil/core/process.py", line 704, in Run
    self.cmd_ev.ExecuteAndCatch(self.node, cmd_flags=cmd_eval.Optimize)
  File "/home/andy/git/oilshell/oil/osh/cmd_eval.py", line 1498, in ExecuteAndCatch
    status = self._Execute(node)
  File "/home/andy/git/oilshell/oil/osh/cmd_eval.py", line 1345, in _Execute
    status, check_errexit = self._Dispatch(node, pipeline_st)
  File "/home/andy/git/oilshell/oil/osh/cmd_eval.py", line 623, in _Dispatch
    status = self._RunSimpleCommand(cmd_val, node.do_fork)
  File "/home/andy/git/oilshell/oil/osh/cmd_eval.py", line 477, in _RunSimpleCommand
    return self.shell_ex.RunSimpleCommand(cmd_val, do_fork)
  File "/home/andy/git/oilshell/oil/core/executor.py", line 230, in RunSimpleCommand
    return self.RunBuiltin(builtin_id, cmd_val)
  File "/home/andy/git/oilshell/oil/core/executor.py", line 121, in RunBuiltin
    builtin_func = self.builtins[builtin_id]
KeyError: 39
osh_.cc18 compgen -A command completes external commands

[osh_.cc stdout] Expected 'xargs\nstatus=0\n', got ''
[osh_.cc status] Expected 0, got -6

stdout:
stderr: 
osh_eval.opt: cpp/posix.h:106: Tuple2<int, int> posix::pipe(): Assertion `0' failed.
osh_.py19 compgen -A command completes functions and aliases

[osh_.py stdout] Expected 'our_alias\nour_func\nour_func2\nstatus=0\n', got ''
[osh_.py status] Expected 0, got 1
[osh_.py stderr] Found 'Traceback (most recent'

stdout:
stderr: 
Traceback (most recent call last):
  File "/home/andy/git/oilshell/oil/bin/osh_eval.py", line 68, in <module>
    sys.exit(main(sys.argv))
  File "/home/andy/git/oilshell/oil/bin/osh_eval.py", line 36, in main
    None)
  File "/home/andy/git/oilshell/oil/core/shell_native.py", line 476, in Main
    cmd_flags=cmd_eval.IsMainProgram)
  File "/home/andy/git/oilshell/oil/core/main_loop.py", line 324, in Batch
    is_return, is_fatal = cmd_ev.ExecuteAndCatch(node, cmd_flags=cmd_flags)
  File "/home/andy/git/oilshell/oil/osh/cmd_eval.py", line 1498, in ExecuteAndCatch
    status = self._Execute(node)
  File "/home/andy/git/oilshell/oil/osh/cmd_eval.py", line 1345, in _Execute
    status, check_errexit = self._Dispatch(node, pipeline_st)
  File "/home/andy/git/oilshell/oil/osh/cmd_eval.py", line 623, in _Dispatch
    status = self._RunSimpleCommand(cmd_val, node.do_fork)
  File "/home/andy/git/oilshell/oil/osh/cmd_eval.py", line 477, in _RunSimpleCommand
    return self.shell_ex.RunSimpleCommand(cmd_val, do_fork)
  File "/home/andy/git/oilshell/oil/core/executor.py", line 230, in RunSimpleCommand
    return self.RunBuiltin(builtin_id, cmd_val)
  File "/home/andy/git/oilshell/oil/core/executor.py", line 121, in RunBuiltin
    builtin_func = self.builtins[builtin_id]
KeyError: 39
osh_.cc19 compgen -A command completes functions and aliases

[osh_.cc stdout] Expected 'our_alias\nour_func\nour_func2\nstatus=0\n', got ''
[osh_.cc status] Expected 0, got -6

stdout:
stderr: 
osh_eval.opt: mycpp/mylib.h:674: V Dict<K, V>::index(K) [with K = int; V = vm::_Builtin*]: Assertion `0' failed.
osh_.py20 compgen -A command completes builtins and keywords

[osh_.py stdout] Expected 'eval\nstatus=0\nwhile\nstatus=0\n', got ''
[osh_.py status] Expected 0, got 1
[osh_.py stderr] Found 'Traceback (most recent'

stdout:
stderr: 
Traceback (most recent call last):
  File "/home/andy/git/oilshell/oil/bin/osh_eval.py", line 68, in <module>
    sys.exit(main(sys.argv))
  File "/home/andy/git/oilshell/oil/bin/osh_eval.py", line 36, in main
    None)
  File "/home/andy/git/oilshell/oil/core/shell_native.py", line 476, in Main
    cmd_flags=cmd_eval.IsMainProgram)
  File "/home/andy/git/oilshell/oil/core/main_loop.py", line 324, in Batch
    is_return, is_fatal = cmd_ev.ExecuteAndCatch(node, cmd_flags=cmd_flags)
  File "/home/andy/git/oilshell/oil/osh/cmd_eval.py", line 1498, in ExecuteAndCatch
    status = self._Execute(node)
  File "/home/andy/git/oilshell/oil/osh/cmd_eval.py", line 1345, in _Execute
    status, check_errexit = self._Dispatch(node, pipeline_st)
  File "/home/andy/git/oilshell/oil/osh/cmd_eval.py", line 623, in _Dispatch
    status = self._RunSimpleCommand(cmd_val, node.do_fork)
  File "/home/andy/git/oilshell/oil/osh/cmd_eval.py", line 477, in _RunSimpleCommand
    return self.shell_ex.RunSimpleCommand(cmd_val, do_fork)
  File "/home/andy/git/oilshell/oil/core/executor.py", line 230, in RunSimpleCommand
    return self.RunBuiltin(builtin_id, cmd_val)
  File "/home/andy/git/oilshell/oil/core/executor.py", line 121, in RunBuiltin
    builtin_func = self.builtins[builtin_id]
KeyError: 39
osh_.cc20 compgen -A command completes builtins and keywords

[osh_.cc stdout] Expected 'eval\nstatus=0\nwhile\nstatus=0\n', got ''
[osh_.cc status] Expected 0, got -6

stdout:
stderr: 
osh_eval.opt: mycpp/mylib.h:674: V Dict<K, V>::index(K) [with K = int; V = vm::_Builtin*]: Assertion `0' failed.
osh_.py21 complete with nonexistent function

[osh_.py stdout] Expected 'status=2\n', got ''
[osh_.py status] Expected 0, got 1
[osh_.py stderr] Found 'Traceback (most recent'

stdout:
stderr: 
Traceback (most recent call last):
  File "/home/andy/git/oilshell/oil/bin/osh_eval.py", line 68, in <module>
    sys.exit(main(sys.argv))
  File "/home/andy/git/oilshell/oil/bin/osh_eval.py", line 36, in main
    None)
  File "/home/andy/git/oilshell/oil/core/shell_native.py", line 476, in Main
    cmd_flags=cmd_eval.IsMainProgram)
  File "/home/andy/git/oilshell/oil/core/main_loop.py", line 324, in Batch
    is_return, is_fatal = cmd_ev.ExecuteAndCatch(node, cmd_flags=cmd_flags)
  File "/home/andy/git/oilshell/oil/osh/cmd_eval.py", line 1498, in ExecuteAndCatch
    status = self._Execute(node)
  File "/home/andy/git/oilshell/oil/osh/cmd_eval.py", line 1345, in _Execute
    status, check_errexit = self._Dispatch(node, pipeline_st)
  File "/home/andy/git/oilshell/oil/osh/cmd_eval.py", line 623, in _Dispatch
    status = self._RunSimpleCommand(cmd_val, node.do_fork)
  File "/home/andy/git/oilshell/oil/osh/cmd_eval.py", line 477, in _RunSimpleCommand
    return self.shell_ex.RunSimpleCommand(cmd_val, do_fork)
  File "/home/andy/git/oilshell/oil/core/executor.py", line 230, in RunSimpleCommand
    return self.RunBuiltin(builtin_id, cmd_val)
  File "/home/andy/git/oilshell/oil/core/executor.py", line 121, in RunBuiltin
    builtin_func = self.builtins[builtin_id]
KeyError: 38
osh_.cc21 complete with nonexistent function

[osh_.cc stdout] Expected 'status=2\n', got ''
[osh_.cc status] Expected 0, got -6

stdout:
stderr: 
osh_eval.opt: mycpp/mylib.h:674: V Dict<K, V>::index(K) [with K = int; V = vm::_Builtin*]: Assertion `0' failed.
osh_.py22 complete with no action

[osh_.py stdout] Expected 'status=2\n', got ''
[osh_.py status] Expected 0, got 1
[osh_.py stderr] Found 'Traceback (most recent'

stdout:
stderr: 
Traceback (most recent call last):
  File "/home/andy/git/oilshell/oil/bin/osh_eval.py", line 68, in <module>
    sys.exit(main(sys.argv))
  File "/home/andy/git/oilshell/oil/bin/osh_eval.py", line 36, in main
    None)
  File "/home/andy/git/oilshell/oil/core/shell_native.py", line 476, in Main
    cmd_flags=cmd_eval.IsMainProgram)
  File "/home/andy/git/oilshell/oil/core/main_loop.py", line 324, in Batch
    is_return, is_fatal = cmd_ev.ExecuteAndCatch(node, cmd_flags=cmd_flags)
  File "/home/andy/git/oilshell/oil/osh/cmd_eval.py", line 1498, in ExecuteAndCatch
    status = self._Execute(node)
  File "/home/andy/git/oilshell/oil/osh/cmd_eval.py", line 1345, in _Execute
    status, check_errexit = self._Dispatch(node, pipeline_st)
  File "/home/andy/git/oilshell/oil/osh/cmd_eval.py", line 623, in _Dispatch
    status = self._RunSimpleCommand(cmd_val, node.do_fork)
  File "/home/andy/git/oilshell/oil/osh/cmd_eval.py", line 477, in _RunSimpleCommand
    return self.shell_ex.RunSimpleCommand(cmd_val, do_fork)
  File "/home/andy/git/oilshell/oil/core/executor.py", line 230, in RunSimpleCommand
    return self.RunBuiltin(builtin_id, cmd_val)
  File "/home/andy/git/oilshell/oil/core/executor.py", line 121, in RunBuiltin
    builtin_func = self.builtins[builtin_id]
KeyError: 38
osh_.cc22 complete with no action

[osh_.cc stdout] Expected 'status=2\n', got ''
[osh_.cc status] Expected 0, got -6

stdout:
stderr: 
osh_eval.opt: mycpp/mylib.h:674: V Dict<K, V>::index(K) [with K = int; V = vm::_Builtin*]: Assertion `0' failed.
osh_.py23 -o filenames and -o nospace have no effect with compgen

[osh_.py stdout] Expected 'bin\nbuild\n', got ''
[osh_.py status] Expected 0, got 1
[osh_.py stderr] Found 'Traceback (most recent'

stdout:
stderr: 
Traceback (most recent call last):
  File "/home/andy/git/oilshell/oil/bin/osh_eval.py", line 68, in <module>
    sys.exit(main(sys.argv))
  File "/home/andy/git/oilshell/oil/bin/osh_eval.py", line 36, in main
    None)
  File "/home/andy/git/oilshell/oil/core/shell_native.py", line 476, in Main
    cmd_flags=cmd_eval.IsMainProgram)
  File "/home/andy/git/oilshell/oil/core/main_loop.py", line 324, in Batch
    is_return, is_fatal = cmd_ev.ExecuteAndCatch(node, cmd_flags=cmd_flags)
  File "/home/andy/git/oilshell/oil/osh/cmd_eval.py", line 1498, in ExecuteAndCatch
    status = self._Execute(node)
  File "/home/andy/git/oilshell/oil/osh/cmd_eval.py", line 1345, in _Execute
    status, check_errexit = self._Dispatch(node, pipeline_st)
  File "/home/andy/git/oilshell/oil/osh/cmd_eval.py", line 623, in _Dispatch
    status = self._RunSimpleCommand(cmd_val, node.do_fork)
  File "/home/andy/git/oilshell/oil/osh/cmd_eval.py", line 477, in _RunSimpleCommand
    return self.shell_ex.RunSimpleCommand(cmd_val, do_fork)
  File "/home/andy/git/oilshell/oil/core/executor.py", line 230, in RunSimpleCommand
    return self.RunBuiltin(builtin_id, cmd_val)
  File "/home/andy/git/oilshell/oil/core/executor.py", line 121, in RunBuiltin
    builtin_func = self.builtins[builtin_id]
KeyError: 39
osh_.cc23 -o filenames and -o nospace have no effect with compgen

[osh_.cc stdout] Expected 'bin\nbuild\n', got ''
[osh_.cc status] Expected 0, got -6

stdout:
stderr: 
osh_eval.opt: mycpp/mylib.h:674: V Dict<K, V>::index(K) [with K = int; V = vm::_Builtin*]: Assertion `0' failed.
osh_.py24 -o plusdirs and -o dirnames with compgen

[osh_.py stdout] Expected 'b1\nb2\nbenchmarks\nbin\nbuild\n---\nbenchmarks\nbin\nbuild\n', got '---\n'
[osh_.py stderr] Found 'Traceback (most recent'

stdout:
---
stderr:
Traceback (most recent call last):
  File "/home/andy/git/oilshell/oil/bin/osh_eval.py", line 68, in <module>
    sys.exit(main(sys.argv))
  File "/home/andy/git/oilshell/oil/bin/osh_eval.py", line 36, in main
    None)
  File "/home/andy/git/oilshell/oil/core/shell_native.py", line 476, in Main
    cmd_flags=cmd_eval.IsMainProgram)
  File "/home/andy/git/oilshell/oil/core/main_loop.py", line 324, in Batch
    is_return, is_fatal = cmd_ev.ExecuteAndCatch(node, cmd_flags=cmd_flags)
  File "/home/andy/git/oilshell/oil/osh/cmd_eval.py", line 1498, in ExecuteAndCatch
    status = self._Execute(node)
  File "/home/andy/git/oilshell/oil/osh/cmd_eval.py", line 1345, in _Execute
    status, check_errexit = self._Dispatch(node, pipeline_st)
  File "/home/andy/git/oilshell/oil/osh/cmd_eval.py", line 667, in _Dispatch
    self.shell_ex.RunPipeline(node, pipeline_st)
  File "/home/andy/git/oilshell/oil/core/executor.py", line 325, in RunPipeline
    status_out.codes = pi.Run(self.waiter, self.fd_state)
  File "/home/andy/git/oilshell/oil/core/process.py", line 1080, in Run
    self.Start(waiter)
  File "/home/andy/git/oilshell/oil/core/process.py", line 1017, in Start
    pid = proc.Start(trace.PipelinePart())
  File "/home/andy/git/oilshell/oil/core/process.py", line 880, in Start
    self.thunk.Run()
  File "/home/andy/git/oilshell/oil/core/process.py", line 704, in Run
    self.cmd_ev.ExecuteAndCatch(self.node, cmd_flags=cmd_eval.Optimize)
  File "/home/andy/git/oilshell/oil/osh/cmd_eval.py", line 1498, in ExecuteAndCatch
    status = self._Execute(node)
  File "/home/andy/git/oilshell/oil/osh/cmd_eval.py", line 1345, in _Execute
    status, check_errexit = self._Dispatch(node, pipeline_st)
  File "/home/andy/git/oilshell/oil/osh/cmd_eval.py", line 623, in _Dispatch
    status = self._RunSimpleCommand(cmd_val, node.do_fork)
  File "/home/andy/git/oilshell/oil/osh/cmd_eval.py", line 477, in _RunSimpleCommand
    return self.shell_ex.RunSimpleCommand(cmd_val, do_fork)
  File "/home/andy/git/oilshell/oil/core/executor.py", line 230, in RunSimpleCommand
    return self.RunBuiltin(builtin_id, cmd_val)
  File "/home/andy/git/oilshell/oil/core/executor.py", line 121, in RunBuiltin
    builtin_func = self.builtins[builtin_id]
KeyError: 39
Traceback (most recent call last):
  File "/home/andy/git/oilshell/oil/bin/osh_eval.py", line 68, in <module>
    sys.exit(main(sys.argv))
  File "/home/andy/git/oilshell/oil/bin/osh_eval.py", line 36, in main
    None)
  File "/home/andy/git/oilshell/oil/core/shell_native.py", line 476, in Main
    cmd_flags=cmd_eval.IsMainProgram)
  File "/home/andy/git/oilshell/oil/core/main_loop.py", line 324, in Batch
    is_return, is_fatal = cmd_ev.ExecuteAndCatch(node, cmd_flags=cmd_flags)
  File "/home/andy/git/oilshell/oil/osh/cmd_eval.py", line 1498, in ExecuteAndCatch
    status = self._Execute(node)
  File "/home/andy/git/oilshell/oil/osh/cmd_eval.py", line 1345, in _Execute
    status, check_errexit = self._Dispatch(node, pipeline_st)
  File "/home/andy/git/oilshell/oil/osh/cmd_eval.py", line 667, in _Dispatch
    self.shell_ex.RunPipeline(node, pipeline_st)
  File "/home/andy/git/oilshell/oil/core/executor.py", line 325, in RunPipeline
    status_out.codes = pi.Run(self.waiter, self.fd_state)
  File "/home/andy/git/oilshell/oil/core/process.py", line 1080, in Run
    self.Start(waiter)
  File "/home/andy/git/oilshell/oil/core/process.py", line 1017, in Start
    pid = proc.Start(trace.PipelinePart())
  File "/home/andy/git/oilshell/oil/core/process.py", line 880, in Start
    self.thunk.Run()
  File "/home/andy/git/oilshell/oil/core/process.py", line 704, in Run
    self.cmd_ev.ExecuteAndCatch(self.node, cmd_flags=cmd_eval.Optimize)
  File "/home/andy/git/oilshell/oil/osh/cmd_eval.py", line 1498, in ExecuteAndCatch
    status = self._Execute(node)
  File "/home/andy/git/oilshell/oil/osh/cmd_eval.py", line 1345, in _Execute
    status, check_errexit = self._Dispatch(node, pipeline_st)
  File "/home/andy/git/oilshell/oil/osh/cmd_eval.py", line 623, in _Dispatch
    status = self._RunSimpleCommand(cmd_val, node.do_fork)
  File "/home/andy/git/oilshell/oil/osh/cmd_eval.py", line 477, in _RunSimpleCommand
    return self.shell_ex.RunSimpleCommand(cmd_val, do_fork)
  File "/home/andy/git/oilshell/oil/core/executor.py", line 230, in RunSimpleCommand
    return self.RunBuiltin(builtin_id, cmd_val)
  File "/home/andy/git/oilshell/oil/core/executor.py", line 121, in RunBuiltin
    builtin_func = self.builtins[builtin_id]
KeyError: 39
osh_.cc24 -o plusdirs and -o dirnames with compgen

[osh_.cc stdout] Expected 'b1\nb2\nbenchmarks\nbin\nbuild\n---\nbenchmarks\nbin\nbuild\n', got ''
[osh_.cc status] Expected 0, got -6

stdout:
stderr: 
osh_eval.opt: cpp/posix.h:106: Tuple2<int, int> posix::pipe(): Assertion `0' failed.
osh_.py25 compgen -o default completes files and dirs

[osh_.py stdout] Expected 'spec/tea-func.test.sh\nspec/testdata\nspec/tilde.test.sh\nspec/toysh-posix.test.sh\nspec/toysh.test.sh\nspec/type-compat.test.sh\n', got ''
[osh_.py stderr] Found 'Traceback (most recent'

stdout:
stderr: 
Traceback (most recent call last):
  File "/home/andy/git/oilshell/oil/bin/osh_eval.py", line 68, in <module>
    sys.exit(main(sys.argv))
  File "/home/andy/git/oilshell/oil/bin/osh_eval.py", line 36, in main
    None)
  File "/home/andy/git/oilshell/oil/core/shell_native.py", line 476, in Main
    cmd_flags=cmd_eval.IsMainProgram)
  File "/home/andy/git/oilshell/oil/core/main_loop.py", line 324, in Batch
    is_return, is_fatal = cmd_ev.ExecuteAndCatch(node, cmd_flags=cmd_flags)
  File "/home/andy/git/oilshell/oil/osh/cmd_eval.py", line 1498, in ExecuteAndCatch
    status = self._Execute(node)
  File "/home/andy/git/oilshell/oil/osh/cmd_eval.py", line 1345, in _Execute
    status, check_errexit = self._Dispatch(node, pipeline_st)
  File "/home/andy/git/oilshell/oil/osh/cmd_eval.py", line 667, in _Dispatch
    self.shell_ex.RunPipeline(node, pipeline_st)
  File "/home/andy/git/oilshell/oil/core/executor.py", line 325, in RunPipeline
    status_out.codes = pi.Run(self.waiter, self.fd_state)
  File "/home/andy/git/oilshell/oil/core/process.py", line 1080, in Run
    self.Start(waiter)
  File "/home/andy/git/oilshell/oil/core/process.py", line 1017, in Start
    pid = proc.Start(trace.PipelinePart())
  File "/home/andy/git/oilshell/oil/core/process.py", line 880, in Start
    self.thunk.Run()
  File "/home/andy/git/oilshell/oil/core/process.py", line 704, in Run
    self.cmd_ev.ExecuteAndCatch(self.node, cmd_flags=cmd_eval.Optimize)
  File "/home/andy/git/oilshell/oil/osh/cmd_eval.py", line 1498, in ExecuteAndCatch
    status = self._Execute(node)
  File "/home/andy/git/oilshell/oil/osh/cmd_eval.py", line 1345, in _Execute
    status, check_errexit = self._Dispatch(node, pipeline_st)
  File "/home/andy/git/oilshell/oil/osh/cmd_eval.py", line 623, in _Dispatch
    status = self._RunSimpleCommand(cmd_val, node.do_fork)
  File "/home/andy/git/oilshell/oil/osh/cmd_eval.py", line 477, in _RunSimpleCommand
    return self.shell_ex.RunSimpleCommand(cmd_val, do_fork)
  File "/home/andy/git/oilshell/oil/core/executor.py", line 230, in RunSimpleCommand
    return self.RunBuiltin(builtin_id, cmd_val)
  File "/home/andy/git/oilshell/oil/core/executor.py", line 121, in RunBuiltin
    builtin_func = self.builtins[builtin_id]
KeyError: 39
osh_.cc25 compgen -o default completes files and dirs

[osh_.cc stdout] Expected 'spec/tea-func.test.sh\nspec/testdata\nspec/tilde.test.sh\nspec/toysh-posix.test.sh\nspec/toysh.test.sh\nspec/type-compat.test.sh\n', got ''
[osh_.cc status] Expected 0, got -6

stdout:
stderr: 
osh_eval.opt: cpp/posix.h:106: Tuple2<int, int> posix::pipe(): Assertion `0' failed.
osh_.py26 compgen doesn't respect -X for user-defined functions

[osh_.py stdout] Expected 'one\nthree\n--\ntwo\nbin\n', got ''

stdout:
stderr: 
osh_.cc26 compgen doesn't respect -X for user-defined functions

[osh_.cc stdout] Expected 'one\nthree\n--\ntwo\nbin\n', got ''

stdout:
stderr: 
dumb_alloc:
	gNumNew = 1762
	gNumDelete = 142
	gMemPos = 62496

	gNumMalloc = 48
	gNumFree = 0
	gMemPos2 = 9536
osh_.py27 compgen -W words -X filter

[osh_.py stdout] Expected 'one\nthree\n', got ''

stdout:
stderr: 
osh_.cc27 compgen -W words -X filter

[osh_.cc stdout] Expected 'one\nthree\n', got ''

stdout:
stderr: 
dumb_alloc:
	gNumNew = 1737
	gNumDelete = 132
	gMemPos = 60800

	gNumMalloc = 41
	gNumFree = 0
	gMemPos2 = 9392
osh_.py28 compgen -f -X filter -- $cur

[osh_.py stdout] Expected 'spam.py\nspam.sh\n--\nspam.py\n', got '--\n'
[osh_.py stderr] Found 'Traceback (most recent'

stdout:
--
stderr:
Traceback (most recent call last):
  File "/home/andy/git/oilshell/oil/bin/osh_eval.py", line 68, in <module>
    sys.exit(main(sys.argv))
  File "/home/andy/git/oilshell/oil/bin/osh_eval.py", line 36, in main
    None)
  File "/home/andy/git/oilshell/oil/core/shell_native.py", line 476, in Main
    cmd_flags=cmd_eval.IsMainProgram)
  File "/home/andy/git/oilshell/oil/core/main_loop.py", line 324, in Batch
    is_return, is_fatal = cmd_ev.ExecuteAndCatch(node, cmd_flags=cmd_flags)
  File "/home/andy/git/oilshell/oil/osh/cmd_eval.py", line 1498, in ExecuteAndCatch
    status = self._Execute(node)
  File "/home/andy/git/oilshell/oil/osh/cmd_eval.py", line 1345, in _Execute
    status, check_errexit = self._Dispatch(node, pipeline_st)
  File "/home/andy/git/oilshell/oil/osh/cmd_eval.py", line 667, in _Dispatch
    self.shell_ex.RunPipeline(node, pipeline_st)
  File "/home/andy/git/oilshell/oil/core/executor.py", line 325, in RunPipeline
    status_out.codes = pi.Run(self.waiter, self.fd_state)
  File "/home/andy/git/oilshell/oil/core/process.py", line 1080, in Run
    self.Start(waiter)
  File "/home/andy/git/oilshell/oil/core/process.py", line 1017, in Start
    pid = proc.Start(trace.PipelinePart())
  File "/home/andy/git/oilshell/oil/core/process.py", line 880, in Start
    self.thunk.Run()
  File "/home/andy/git/oilshell/oil/core/process.py", line 704, in Run
    self.cmd_ev.ExecuteAndCatch(self.node, cmd_flags=cmd_eval.Optimize)
  File "/home/andy/git/oilshell/oil/osh/cmd_eval.py", line 1498, in ExecuteAndCatch
    status = self._Execute(node)
  File "/home/andy/git/oilshell/oil/osh/cmd_eval.py", line 1345, in _Execute
    status, check_errexit = self._Dispatch(node, pipeline_st)
  File "/home/andy/git/oilshell/oil/osh/cmd_eval.py", line 623, in _Dispatch
    status = self._RunSimpleCommand(cmd_val, node.do_fork)
  File "/home/andy/git/oilshell/oil/osh/cmd_eval.py", line 477, in _RunSimpleCommand
    return self.shell_ex.RunSimpleCommand(cmd_val, do_fork)
  File "/home/andy/git/oilshell/oil/core/executor.py", line 230, in RunSimpleCommand
    return self.RunBuiltin(builtin_id, cmd_val)
  File "/home/andy/git/oilshell/oil/core/executor.py", line 121, in RunBuiltin
    builtin_func = self.builtins[builtin_id]
KeyError: 39
osh_.cc28 compgen -f -X filter -- $cur

[osh_.cc stdout] Expected 'spam.py\nspam.sh\n--\nspam.py\n', got ''
[osh_.cc status] Expected 0, got -6

stdout:
stderr: 
osh_eval.opt: cpp/posix.h:106: Tuple2<int, int> posix::pipe(): Assertion `0' failed.
osh_.py29 compgen doesn't need shell quoting

[osh_.py stdout] Expected "foo bar\nfoo'bar\n", got ''
[osh_.py status] Expected 0, got 1
[osh_.py stderr] Found 'Traceback (most recent'

stdout:
stderr: 
Traceback (most recent call last):
  File "/home/andy/git/oilshell/oil/bin/osh_eval.py", line 68, in <module>
    sys.exit(main(sys.argv))
  File "/home/andy/git/oilshell/oil/bin/osh_eval.py", line 36, in main
    None)
  File "/home/andy/git/oilshell/oil/core/shell_native.py", line 476, in Main
    cmd_flags=cmd_eval.IsMainProgram)
  File "/home/andy/git/oilshell/oil/core/main_loop.py", line 324, in Batch
    is_return, is_fatal = cmd_ev.ExecuteAndCatch(node, cmd_flags=cmd_flags)
  File "/home/andy/git/oilshell/oil/osh/cmd_eval.py", line 1498, in ExecuteAndCatch
    status = self._Execute(node)
  File "/home/andy/git/oilshell/oil/osh/cmd_eval.py", line 1345, in _Execute
    status, check_errexit = self._Dispatch(node, pipeline_st)
  File "/home/andy/git/oilshell/oil/osh/cmd_eval.py", line 623, in _Dispatch
    status = self._RunSimpleCommand(cmd_val, node.do_fork)
  File "/home/andy/git/oilshell/oil/osh/cmd_eval.py", line 477, in _RunSimpleCommand
    return self.shell_ex.RunSimpleCommand(cmd_val, do_fork)
  File "/home/andy/git/oilshell/oil/core/executor.py", line 230, in RunSimpleCommand
    return self.RunBuiltin(builtin_id, cmd_val)
  File "/home/andy/git/oilshell/oil/core/executor.py", line 121, in RunBuiltin
    builtin_func = self.builtins[builtin_id]
KeyError: 39
osh_.cc29 compgen doesn't need shell quoting

[osh_.cc stdout] Expected "foo bar\nfoo'bar\n", got ''
[osh_.cc status] Expected 0, got -6

stdout:
stderr: 
osh_eval.opt: mycpp/mylib.h:674: V Dict<K, V>::index(K) [with K = int; V = vm::_Builtin*]: Assertion `0' failed.
osh_.py30 compgen -W 'one two three'

[osh_.py stdout] Expected 'one\ntwo\nthree\n--\nweb\nw1\nw2\n--\nweb\nw1\nw2\n', got ''
[osh_.py status] Expected 0, got 1
[osh_.py stderr] Found 'Traceback (most recent'

stdout:
stderr: 
Traceback (most recent call last):
  File "/home/andy/git/oilshell/oil/bin/osh_eval.py", line 68, in <module>
    sys.exit(main(sys.argv))
  File "/home/andy/git/oilshell/oil/bin/osh_eval.py", line 36, in main
    None)
  File "/home/andy/git/oilshell/oil/core/shell_native.py", line 476, in Main
    cmd_flags=cmd_eval.IsMainProgram)
  File "/home/andy/git/oilshell/oil/core/main_loop.py", line 324, in Batch
    is_return, is_fatal = cmd_ev.ExecuteAndCatch(node, cmd_flags=cmd_flags)
  File "/home/andy/git/oilshell/oil/osh/cmd_eval.py", line 1498, in ExecuteAndCatch
    status = self._Execute(node)
  File "/home/andy/git/oilshell/oil/osh/cmd_eval.py", line 1345, in _Execute
    status, check_errexit = self._Dispatch(node, pipeline_st)
  File "/home/andy/git/oilshell/oil/osh/cmd_eval.py", line 623, in _Dispatch
    status = self._RunSimpleCommand(cmd_val, node.do_fork)
  File "/home/andy/git/oilshell/oil/osh/cmd_eval.py", line 477, in _RunSimpleCommand
    return self.shell_ex.RunSimpleCommand(cmd_val, do_fork)
  File "/home/andy/git/oilshell/oil/core/executor.py", line 230, in RunSimpleCommand
    return self.RunBuiltin(builtin_id, cmd_val)
  File "/home/andy/git/oilshell/oil/core/executor.py", line 121, in RunBuiltin
    builtin_func = self.builtins[builtin_id]
KeyError: 39
osh_.cc30 compgen -W 'one two three'

[osh_.cc stdout] Expected 'one\ntwo\nthree\n--\nweb\nw1\nw2\n--\nweb\nw1\nw2\n', got ''
[osh_.cc status] Expected 0, got -6

stdout:
stderr: 
osh_eval.opt: mycpp/mylib.h:674: V Dict<K, V>::index(K) [with K = int; V = vm::_Builtin*]: Assertion `0' failed.
osh_.py31 compgen -W evaluates code in $()

[osh_.py stdout] Expected 'spam\neggs\nham cheese\n', got ''
[osh_.py status] Expected 0, got 1
[osh_.py stderr] Found 'Traceback (most recent'

stdout:
stderr: 
Traceback (most recent call last):
  File "/home/andy/git/oilshell/oil/bin/osh_eval.py", line 68, in <module>
    sys.exit(main(sys.argv))
  File "/home/andy/git/oilshell/oil/bin/osh_eval.py", line 36, in main
    None)
  File "/home/andy/git/oilshell/oil/core/shell_native.py", line 476, in Main
    cmd_flags=cmd_eval.IsMainProgram)
  File "/home/andy/git/oilshell/oil/core/main_loop.py", line 324, in Batch
    is_return, is_fatal = cmd_ev.ExecuteAndCatch(node, cmd_flags=cmd_flags)
  File "/home/andy/git/oilshell/oil/osh/cmd_eval.py", line 1498, in ExecuteAndCatch
    status = self._Execute(node)
  File "/home/andy/git/oilshell/oil/osh/cmd_eval.py", line 1345, in _Execute
    status, check_errexit = self._Dispatch(node, pipeline_st)
  File "/home/andy/git/oilshell/oil/osh/cmd_eval.py", line 623, in _Dispatch
    status = self._RunSimpleCommand(cmd_val, node.do_fork)
  File "/home/andy/git/oilshell/oil/osh/cmd_eval.py", line 477, in _RunSimpleCommand
    return self.shell_ex.RunSimpleCommand(cmd_val, do_fork)
  File "/home/andy/git/oilshell/oil/core/executor.py", line 230, in RunSimpleCommand
    return self.RunBuiltin(builtin_id, cmd_val)
  File "/home/andy/git/oilshell/oil/core/executor.py", line 121, in RunBuiltin
    builtin_func = self.builtins[builtin_id]
KeyError: 39
osh_.cc31 compgen -W evaluates code in $()

[osh_.cc stdout] Expected 'spam\neggs\nham cheese\n', got ''
[osh_.cc status] Expected 0, got -6

stdout:
stderr: 
osh_eval.opt: mycpp/mylib.h:674: V Dict<K, V>::index(K) [with K = int; V = vm::_Builtin*]: Assertion `0' failed.
osh_.py32 compgen -W uses IFS, and delimiters are escaped with \

[osh_.py stdout] Expected 'spam\neggs\nham cheese:colon\n', got ''
[osh_.py status] Expected 0, got 1
[osh_.py stderr] Found 'Traceback (most recent'

stdout:
stderr: 
Traceback (most recent call last):
  File "/home/andy/git/oilshell/oil/bin/osh_eval.py", line 68, in <module>
    sys.exit(main(sys.argv))
  File "/home/andy/git/oilshell/oil/bin/osh_eval.py", line 36, in main
    None)
  File "/home/andy/git/oilshell/oil/core/shell_native.py", line 476, in Main
    cmd_flags=cmd_eval.IsMainProgram)
  File "/home/andy/git/oilshell/oil/core/main_loop.py", line 324, in Batch
    is_return, is_fatal = cmd_ev.ExecuteAndCatch(node, cmd_flags=cmd_flags)
  File "/home/andy/git/oilshell/oil/osh/cmd_eval.py", line 1498, in ExecuteAndCatch
    status = self._Execute(node)
  File "/home/andy/git/oilshell/oil/osh/cmd_eval.py", line 1345, in _Execute
    status, check_errexit = self._Dispatch(node, pipeline_st)
  File "/home/andy/git/oilshell/oil/osh/cmd_eval.py", line 623, in _Dispatch
    status = self._RunSimpleCommand(cmd_val, node.do_fork)
  File "/home/andy/git/oilshell/oil/osh/cmd_eval.py", line 477, in _RunSimpleCommand
    return self.shell_ex.RunSimpleCommand(cmd_val, do_fork)
  File "/home/andy/git/oilshell/oil/core/executor.py", line 230, in RunSimpleCommand
    return self.RunBuiltin(builtin_id, cmd_val)
  File "/home/andy/git/oilshell/oil/core/executor.py", line 121, in RunBuiltin
    builtin_func = self.builtins[builtin_id]
KeyError: 39
osh_.cc32 compgen -W uses IFS, and delimiters are escaped with \

[osh_.cc stdout] Expected 'spam\neggs\nham cheese:colon\n', got ''
[osh_.cc status] Expected 0, got -6

stdout:
stderr: 
osh_eval.opt: mycpp/mylib.h:674: V Dict<K, V>::index(K) [with K = int; V = vm::_Builtin*]: Assertion `0' failed.
osh_.py33 Parse errors for compgen -W and complete -W

[osh_.py stdout] Expected 'status=2\nstatus=2\n', got ''
[osh_.py status] Expected 0, got 1
[osh_.py stderr] Found 'Traceback (most recent'

stdout:
stderr: 
Traceback (most recent call last):
  File "/home/andy/git/oilshell/oil/bin/osh_eval.py", line 68, in <module>
    sys.exit(main(sys.argv))
  File "/home/andy/git/oilshell/oil/bin/osh_eval.py", line 36, in main
    None)
  File "/home/andy/git/oilshell/oil/core/shell_native.py", line 476, in Main
    cmd_flags=cmd_eval.IsMainProgram)
  File "/home/andy/git/oilshell/oil/core/main_loop.py", line 324, in Batch
    is_return, is_fatal = cmd_ev.ExecuteAndCatch(node, cmd_flags=cmd_flags)
  File "/home/andy/git/oilshell/oil/osh/cmd_eval.py", line 1498, in ExecuteAndCatch
    status = self._Execute(node)
  File "/home/andy/git/oilshell/oil/osh/cmd_eval.py", line 1345, in _Execute
    status, check_errexit = self._Dispatch(node, pipeline_st)
  File "/home/andy/git/oilshell/oil/osh/cmd_eval.py", line 623, in _Dispatch
    status = self._RunSimpleCommand(cmd_val, node.do_fork)
  File "/home/andy/git/oilshell/oil/osh/cmd_eval.py", line 477, in _RunSimpleCommand
    return self.shell_ex.RunSimpleCommand(cmd_val, do_fork)
  File "/home/andy/git/oilshell/oil/core/executor.py", line 230, in RunSimpleCommand
    return self.RunBuiltin(builtin_id, cmd_val)
  File "/home/andy/git/oilshell/oil/core/executor.py", line 121, in RunBuiltin
    builtin_func = self.builtins[builtin_id]
KeyError: 39
osh_.cc33 Parse errors for compgen -W and complete -W

[osh_.cc stdout] Expected 'status=2\nstatus=2\n', got ''
[osh_.cc status] Expected 0, got -6

stdout:
stderr: 
osh_eval.opt: mycpp/mylib.h:674: V Dict<K, V>::index(K) [with K = int; V = vm::_Builtin*]: Assertion `0' failed.
osh_.py34 Runtime errors for compgen -W

[osh_.py stdout] Expected 'status=1\n', got ''
[osh_.py status] Expected 0, got 1
[osh_.py stderr] Found 'Traceback (most recent'

stdout:
stderr: 
Traceback (most recent call last):
  File "/home/andy/git/oilshell/oil/bin/osh_eval.py", line 68, in <module>
    sys.exit(main(sys.argv))
  File "/home/andy/git/oilshell/oil/bin/osh_eval.py", line 36, in main
    None)
  File "/home/andy/git/oilshell/oil/core/shell_native.py", line 476, in Main
    cmd_flags=cmd_eval.IsMainProgram)
  File "/home/andy/git/oilshell/oil/core/main_loop.py", line 324, in Batch
    is_return, is_fatal = cmd_ev.ExecuteAndCatch(node, cmd_flags=cmd_flags)
  File "/home/andy/git/oilshell/oil/osh/cmd_eval.py", line 1498, in ExecuteAndCatch
    status = self._Execute(node)
  File "/home/andy/git/oilshell/oil/osh/cmd_eval.py", line 1345, in _Execute
    status, check_errexit = self._Dispatch(node, pipeline_st)
  File "/home/andy/git/oilshell/oil/osh/cmd_eval.py", line 623, in _Dispatch
    status = self._RunSimpleCommand(cmd_val, node.do_fork)
  File "/home/andy/git/oilshell/oil/osh/cmd_eval.py", line 477, in _RunSimpleCommand
    return self.shell_ex.RunSimpleCommand(cmd_val, do_fork)
  File "/home/andy/git/oilshell/oil/core/executor.py", line 230, in RunSimpleCommand
    return self.RunBuiltin(builtin_id, cmd_val)
  File "/home/andy/git/oilshell/oil/core/executor.py", line 121, in RunBuiltin
    builtin_func = self.builtins[builtin_id]
KeyError: 39
osh_.cc34 Runtime errors for compgen -W

[osh_.cc stdout] Expected 'status=1\n', got ''
[osh_.cc status] Expected 0, got -6

stdout:
stderr: 
osh_eval.opt: mycpp/mylib.h:674: V Dict<K, V>::index(K) [with K = int; V = vm::_Builtin*]: Assertion `0' failed.
osh35 Runtime errors for compgen -F func

[osh stdout] Expected 'status=1\n', got 'foo\nbar\nstatus=0\n'

stdout:
foo
bar
status=0
stderr:
    COMPREPLY+=( $(( 1 / 0 )) )  # FATAL, but we still have candidates
                         ^
[ stdin ]:3: Divide by zero
osh_.py35 Runtime errors for compgen -F func

[osh_.py stdout] Expected 'status=1\n', got ''
[osh_.py status] Expected 0, got 1
[osh_.py stderr] Found 'Traceback (most recent'

stdout:
stderr: 
Traceback (most recent call last):
  File "/home/andy/git/oilshell/oil/bin/osh_eval.py", line 68, in <module>
    sys.exit(main(sys.argv))
  File "/home/andy/git/oilshell/oil/bin/osh_eval.py", line 36, in main
    None)
  File "/home/andy/git/oilshell/oil/core/shell_native.py", line 476, in Main
    cmd_flags=cmd_eval.IsMainProgram)
  File "/home/andy/git/oilshell/oil/core/main_loop.py", line 324, in Batch
    is_return, is_fatal = cmd_ev.ExecuteAndCatch(node, cmd_flags=cmd_flags)
  File "/home/andy/git/oilshell/oil/osh/cmd_eval.py", line 1498, in ExecuteAndCatch
    status = self._Execute(node)
  File "/home/andy/git/oilshell/oil/osh/cmd_eval.py", line 1345, in _Execute
    status, check_errexit = self._Dispatch(node, pipeline_st)
  File "/home/andy/git/oilshell/oil/osh/cmd_eval.py", line 623, in _Dispatch
    status = self._RunSimpleCommand(cmd_val, node.do_fork)
  File "/home/andy/git/oilshell/oil/osh/cmd_eval.py", line 477, in _RunSimpleCommand
    return self.shell_ex.RunSimpleCommand(cmd_val, do_fork)
  File "/home/andy/git/oilshell/oil/core/executor.py", line 230, in RunSimpleCommand
    return self.RunBuiltin(builtin_id, cmd_val)
  File "/home/andy/git/oilshell/oil/core/executor.py", line 121, in RunBuiltin
    builtin_func = self.builtins[builtin_id]
KeyError: 39
osh_.cc35 Runtime errors for compgen -F func

[osh_.cc stdout] Expected 'status=1\n', got ''
[osh_.cc status] Expected 0, got -6

stdout:
stderr: 
osh_eval.opt: mycpp/mylib.h:674: V Dict<K, V>::index(K) [with K = int; V = vm::_Builtin*]: Assertion `0' failed.
osh_.py36 compgen -W '' cmd is not a usage error

[osh_.py stdout] Expected 'status=1\n', got ''
[osh_.py status] Expected 0, got 1
[osh_.py stderr] Found 'Traceback (most recent'

stdout:
stderr: 
Traceback (most recent call last):
  File "/home/andy/git/oilshell/oil/bin/osh_eval.py", line 68, in <module>
    sys.exit(main(sys.argv))
  File "/home/andy/git/oilshell/oil/bin/osh_eval.py", line 36, in main
    None)
  File "/home/andy/git/oilshell/oil/core/shell_native.py", line 476, in Main
    cmd_flags=cmd_eval.IsMainProgram)
  File "/home/andy/git/oilshell/oil/core/main_loop.py", line 324, in Batch
    is_return, is_fatal = cmd_ev.ExecuteAndCatch(node, cmd_flags=cmd_flags)
  File "/home/andy/git/oilshell/oil/osh/cmd_eval.py", line 1498, in ExecuteAndCatch
    status = self._Execute(node)
  File "/home/andy/git/oilshell/oil/osh/cmd_eval.py", line 1345, in _Execute
    status, check_errexit = self._Dispatch(node, pipeline_st)
  File "/home/andy/git/oilshell/oil/osh/cmd_eval.py", line 623, in _Dispatch
    status = self._RunSimpleCommand(cmd_val, node.do_fork)
  File "/home/andy/git/oilshell/oil/osh/cmd_eval.py", line 477, in _RunSimpleCommand
    return self.shell_ex.RunSimpleCommand(cmd_val, do_fork)
  File "/home/andy/git/oilshell/oil/core/executor.py", line 230, in RunSimpleCommand
    return self.RunBuiltin(builtin_id, cmd_val)
  File "/home/andy/git/oilshell/oil/core/executor.py", line 121, in RunBuiltin
    builtin_func = self.builtins[builtin_id]
KeyError: 39
osh_.cc36 compgen -W '' cmd is not a usage error

[osh_.cc stdout] Expected 'status=1\n', got ''
[osh_.cc status] Expected 0, got -6

stdout:
stderr: 
osh_eval.opt: mycpp/mylib.h:674: V Dict<K, V>::index(K) [with K = int; V = vm::_Builtin*]: Assertion `0' failed.